program: Gaussian 09
title: 000025900
version: EM64L-G09RevD.01
frameworkgroup: C1[X(C23H33NO2)]
method: RPBEPBE
basis: SDD
operation: Freq
keyword: #p
keyword: freq=noraman
keyword: PBEPBE/SDD
title: #p freq=noraman PBEPBE/SDD
converged: YES YES NO NO
title: Mulliken charges:
elementType: O O N C C C C C C C C C C C C C C C C C C C C C C C H H H H H H H H H H H H H H H H H H H H H H H H H H H H H H H H H
charge: -0.288885 -0.213544 -0.077512 0.102847 -0.095916 -0.488581 0.408078 -0.402113 0.128288 -0.745748 -0.758593 0.134555 -0.370193 -0.426840 0.397301 -0.290493 -0.327349 -0.475956 0.044863 -0.442343 -0.316044 -0.626027 -0.617151 -0.253870 -0.693123 -0.688755 0.221390 0.244637 0.219466 0.233826 0.212226 0.203711 0.229264 0.257988 0.212858 0.230612 0.230757 0.177834 0.208364 0.243573 0.226584 0.248011 0.238934 0.232454 0.237095 0.226271 0.185741 0.216687 0.235599 0.219925 0.185168 0.224146 0.228219 0.214122 0.264535 0.212147 0.209752 0.228903 0.222308
chargesum: 0.00000
title: Mulliken charges with hydrogens summed into heavy atoms:
elementType: O O N C C C C C C C C C C C C C C C C C C C C C C C
charge: -0.288885 -0.213544 -0.077512 0.102847 0.125474 -0.024478 0.408078 0.043938 0.128288 -0.054785 -0.084366 0.134555 0.016005 -0.183267 0.397301 -0.063910 -0.079338 -0.237022 0.277317 -0.205249 -0.089774 0.012000 0.012088 -0.025651 -0.002320 -0.027791
polarizability: 2.37778546e+02 -4.92940428e+00 2.88985569e+02 -3.80300627e+01 -5.75284841e+00 2.61498938e+02
1716.lowfreq: -10.4015 -5.6818 -0.0005 -0.0002 0.0002 1.1075 22.6180 28.3746 30.7992
frequency: 22.4911 28.1554 30.7506 41.9442 46.8844 53.1780 71.9662 94.4450 102.9891 116.3688 129.8422 134.5517 150.4351 161.8365 178.7224 188.8083 192.5764 199.2277 202.5042 208.3070 215.3181 228.8212 237.5804 252.8410 257.5307 262.3851 297.5632 315.6998 335.1958 352.4230 358.4787 384.9053 387.9617 405.4953 424.6406 431.9304 436.1600 454.5644 474.4915 477.9813 498.4795 515.3730 525.3449 551.5287 607.2989 629.8531 672.6968 687.6596 731.7647 745.6446 753.1143 773.9007 777.5466 788.0165 791.8898 812.7718 819.7290 841.1185 872.8334 884.9260 889.7567 915.1570 923.8535 925.6452 932.0144 934.5479 943.6595 960.6173 963.0196 983.8163 991.2906 1007.2079 1013.9812 1030.2022 1037.3055 1042.7779 1058.9204 1073.8771 1079.5842 1092.1946 1093.4765 1100.9001 1109.2873 1132.2324 1143.6287 1150.0127 1151.1100 1156.2834 1166.7123 1175.9634 1179.9407 1183.8619 1191.4999 1224.4206 1235.0213 1239.0422 1261.7957 1274.0793 1284.6674 1296.0827 1304.5674 1307.1258 1316.7408 1330.6274 1335.0374 1349.0712 1362.8649 1372.3005 1379.9473 1387.5388 1396.7364 1401.7290 1406.1914 1411.2752 1415.9866 1439.9143 1440.8069 1457.2722 1457.8049 1460.1116 1460.9571 1462.9256 1465.6606 1468.4921 1473.7952 1474.4840 1474.8437 1477.0274 1482.2890 1484.8958 1488.0708 1488.6831 1501.3367 1517.0131 1586.9214 1601.8619 1610.6987 1630.9800 2819.4926 2840.3018 2856.8683 2983.8297 2986.1807 2987.0913 2989.1004 2990.7310 2992.9869 2999.2973 3010.9978 3015.4912 3026.0873 3028.0717 3047.6446 3071.1572 3074.3063 3075.4691 3077.9115 3080.3428 3086.8227 3087.3709 3090.6445 3096.0307 3101.9566 3103.2969 3119.2565 3122.2100 3130.2610 3145.2710 3154.5334 3171.0186 3172.2942
redmass: 4.4204 2.6045 3.2678 3.8671 3.3594 3.6407 3.8300 3.6178 2.5417 3.1056 2.3844 3.7282 2.3789 3.3380 2.1859 3.4474 1.9460 1.4182 1.6470 1.6180 2.5433 1.1250 1.7553 1.2295 1.5731 2.5783 4.0268 3.0076 2.4606 2.4614 2.5735 3.0544 3.4838 2.9092 2.8402 2.4293 2.9956 2.8659 3.2434 3.1911 3.2087 6.2405 6.0423 3.3527 4.1158 4.5075 4.0313 4.2386 2.9878 1.3338 1.6226 3.3468 3.8157 2.4096 2.9255 1.9606 3.2952 1.9333 1.8001 2.0500 2.3033 2.1487 1.8647 1.2173 2.0064 1.4630 1.4187 1.3824 1.3738 1.3626 1.3401 3.2407 2.8734 1.5262 2.4841 4.1774 3.1679 2.1090 2.2334 1.5051 2.3364 1.7537 1.8125 1.8669 2.1094 1.7739 1.9727 2.0392 1.5364 1.9455 1.1538 1.8942 1.5113 1.9489 1.8925 1.7643 2.4251 1.6148 1.5903 1.1923 1.2343 1.2792 1.4038 1.3703 1.3480 1.4146 2.2513 1.3979 1.2546 1.1948 1.2327 2.6100 1.2100 4.3379 1.1423 1.1700 2.4457 1.6727 1.1804 1.0926 1.0488 1.0834 1.0555 1.0537 1.0543 1.0535 1.0697 1.0507 1.0695 1.0547 1.0634 1.0501 1.0666 3.6203 7.2993 5.3087 10.4505 6.3500 1.0697 1.0576 1.0577 1.0371 1.0357 1.0567 1.0477 1.0360 1.0741 1.0845 1.0628 1.0715 1.0863 1.0720 1.0995 1.0996 1.1010 1.1004 1.0987 1.0994 1.0997 1.0989 1.0988 1.1004 1.1006 1.0980 1.0862 1.0861 1.0899 1.0951 1.0965 1.0952 1.0938
irintensity: 0.0708 0.4614 0.2095 0.0817 0.2179 0.3703 1.1244 0.2203 0.5119 0.4297 0.8297 0.8639 0.0569 0.8372 0.8899 1.9119 1.2303 0.5031 0.4365 1.1973 0.3428 1.2131 1.4368 0.4863 3.0238 1.2223 3.8232 1.8741 5.9764 0.2854 2.8485 2.6957 5.4693 1.4522 0.7617 1.5087 4.9634 3.5857 0.4954 3.3339 11.2948 1.1908 3.9446 9.2221 2.6751 1.4025 0.1770 0.1881 8.7564 5.7357 3.5690 2.0352 6.5249 48.6380 33.3913 55.3277 8.2201 4.2833 4.2323 1.5135 6.8755 37.4968 16.4888 2.3518 7.6876 16.9916 2.5043 1.5049 2.5942 2.0906 0.5461 3.9482 18.9448 11.3223 8.2727 42.9249 49.1605 39.1368 224.0507 1.0517 33.4956 31.5308 2.1496 1.4249 33.4755 33.1985 31.5312 13.7755 21.3405 14.5700 0.7124 2.9125 6.8823 12.1741 4.9458 2.1257 3.9579 10.5419 5.2001 6.6041 26.0897 1.8330 1.3910 1.6814 2.8341 0.3162 9.0966 16.3533 27.1890 14.0791 22.7099 2.8228 31.3815 5.4998 2.3057 3.7492 3.6947 3.0386 3.9235 3.3269 18.6548 4.9347 4.2749 2.7102 12.0342 3.2759 7.7045 10.8391 4.0183 7.1350 37.4032 17.8508 3.7825 8.7364 3.2715 14.2544 124.6126 0.4389 59.9728 69.5740 203.7823 21.2757 13.5870 42.9503 13.1416 25.0940 10.6172 21.7339 24.3577 48.0371 5.9956 44.5659 9.9245 11.1182 25.8430 56.2669 55.0147 14.5124 9.5420 72.4034 55.3700 23.6598 26.0898 30.6924 0.8128 2.5068 14.8398 30.6592 42.0385 23.7264 6.5077
temp: 298.150 k
press: 1.00000 atm
elementType: 8 8 7 6 6 6 6 6 6 6 6 6 6 6 6 6 6 6 6 6 6 6 6 6 6 6 1 1 1 1 1 1 1 1 1 1 1 1 1 1 1 1 1 1 1 1 1 1 1 1 1 1 1 1 1 1 1 1 1
symmnumber: 1
zpe: 1331430.5 jmol-1
zpe.correction: 0.507115 hartree
zpe.thermalcorrener: 0.535276 hartree
zpe.thermalcorrenthalpy: 0.536220 hartree
zpe.thermalcorrgfe: 0.448256 hartree
zpe.sumelectzpe: -1099.450371 hartree
zpe.sumelectthermal: -1099.422211 hartree
zpe.sumelectthermalent: -1099.421267 hartree
zpe.sumelectthermalfe: -1099.509231 hartree
dipole: -0.5170 -0.9826 -1.6911
dipole: 2.0231
quadrupole: -157.9471 -147.0888 -151.3719
quadrupole: -10.1709 -8.6406 1.4807
quadrupole: -5.8112 5.0471 0.7640 -10.1709 -8.6406 1.4807
hfenergy: -1099.9574864 hartree
pointgroup: C01[X(C23H33N1O2)]
dipole: -0.1048794 -0.4507061 -0.6475918 debye
polarizability: 242.9052301|-26.1510218|275.0112166|-28.9182607|-18.4209049|270.3466061 unknown
InChI: InChI=1S/C23H33NO2/c1-17(2)23(15-10-16-24(5)6,22(25)26-18(3)4)21-14-9-12-19-11-7-8-13-20(19)21/h7-9,11-14,17-18H,10,15-16H2,1-6H3
charge 0 multiplicity 1
59 atoms
O  2.463432 -1.057194 -0.782834
O  2.775683 0.800895 0.578982
N  -3.616653 -3.192751 -0.264656
C  0.624423 -0.438707 0.727037
C  0.882068 -1.220103 2.09734
C  -0.210764 -1.345207 -0.251603
C  -0.144367 0.900982 0.928964
C  -1.571808 -1.817725 0.308075
C  2.037776 -0.128407 0.177679
C  1.782505 -0.461235 3.10689
C  1.453019 -2.64505 1.88588
C  -0.250147 1.87721 -0.146367
C  -2.392706 -2.534716 -0.784774
C  -0.83168 1.163588 2.12232
C  -1.024865 3.089257 0.066991
C  -1.599966 2.349617 2.324277
C  0.364113 1.717345 -1.437828
C  -1.690484 3.304524 1.316784
C  3.867739 -0.888196 -1.316271
C  -1.129674 4.067982 -0.977436
C  0.242338 2.683827 -2.437806
C  -4.622945 -2.234114 0.237092
C  -4.201543 -4.120481 -1.254807
C  -0.508259 3.877933 -2.210599
C  3.854278 0.164467 -2.433975
C  4.292198 -2.283542 -1.779491
H  -0.118615 -1.346664 2.554317
H  0.398506 -2.217618 -0.542726
H  -0.397026 -0.778086 -1.182708
H  -2.131993 -0.949081 0.701097
H  -1.435347 -2.528591 1.145079
H  1.687383 -0.92486 4.106879
H  2.845017 -0.512444 2.811277
H  1.523893 0.606292 3.189731
H  1.641949 -3.109512 2.871352
H  2.410923 -2.6228 1.335542
H  0.760912 -3.304666 1.335077
H  -2.633681 -1.802875 -1.602631
H  -1.762217 -3.324881 -1.239094
H  -0.788185 0.449727 2.947952
H  -2.110097 2.499429 3.282084
H  0.943967 0.819139 -1.662998
H  -2.269752 4.224312 1.460455
H  4.489617 -0.532108 -0.473914
H  -1.715664 4.974737 -0.783979
H  0.727646 2.524713 -3.407412
H  -4.988573 -1.528671 -0.553698
H  -5.493753 -2.788866 0.630348
H  -4.205201 -1.634193 1.062607
H  -5.06059 -4.65084 -0.805489
H  -4.561449 -3.611281 -2.186334
H  -3.449392 -4.874888 -1.547805
H  -0.59406 4.631281 -3.001175
H  4.869668 0.273708 -2.857548
H  3.537901 1.146304 -2.044047
H  3.172539 -0.142413 -3.247888
H  5.326797 -2.252089 -2.166985
H  4.254311 -3.004979 -0.94517
H  3.629556 -2.646635 -2.584858
