program: Gaussian 09
title: 000277036
version: EM64L-G09RevD.01
frameworkgroup: C1[X(C16H15NO4)]
method: RPBEPBE
basis: SDD
operation: Freq
keyword: #p
keyword: freq=noraman
keyword: PBEPBE/SDD
title: #p freq=noraman PBEPBE/SDD
converged: YES YES NO NO
title: Mulliken charges:
elementType: O O O O N C C C C C C C C C C C C C C C C H H H H H H H H H H H H H H H
charge: -0.263621 -0.256372 -0.259974 -0.415427 -0.151975 0.214765 0.171575 0.513287 -0.492683 -0.336737 -0.376031 -0.203050 0.153371 -0.398029 0.381085 0.162024 -0.292369 -0.495599 -0.374861 -0.243778 -0.684812 0.272928 0.253971 0.229933 0.241321 0.241549 0.205908 0.226521 0.273343 0.243075 0.208830 0.209144 0.206719 0.233568 0.233549 0.368850
chargesum: 0.00000
title: Mulliken charges with hydrogens summed into heavy atoms:
elementType: O O O O N C C C C C C C C C C C C C C C C
charge: -0.263621 -0.256372 -0.259974 -0.046576 -0.151975 0.214765 0.171575 0.513287 -0.219755 -0.082766 -0.146099 0.279819 0.153371 -0.192121 0.381085 0.162024 -0.065848 -0.222255 -0.131786 0.174196 -0.010976
polarizability: 5.04131739e+02 5.73104187e+00 1.91633556e+02 7.64613708e-02 5.05885049e-03 8.85175402e+01
1716.lowfreq: -15.0510 -3.3699 0.0006 0.0009 0.0015 3.3589 5.5915 17.5757 30.4404
frequency: -14.4900 16.8818 30.3963 42.3603 60.2158 98.5042 111.8878 112.4958 167.7735 190.8948 206.1726 212.3857 226.1038 237.0403 250.8831 323.6186 338.3495 341.8662 373.2866 391.3946 425.4612 458.1881 460.7759 463.0474 540.0881 570.2715 603.9484 605.1250 617.1949 627.1795 680.8505 718.9769 724.2567 731.5934 759.1229 768.9707 778.6382 783.2861 809.2842 821.5613 830.5661 841.5063 860.8700 866.0724 887.9469 916.1007 926.0686 934.5829 957.8454 958.6793 978.1924 1032.6139 1057.2523 1065.7143 1108.2231 1117.2102 1119.9427 1133.0381 1135.4298 1150.7828 1178.5215 1201.5670 1231.0496 1254.6287 1263.9951 1266.7536 1270.9410 1294.8981 1354.8739 1364.2742 1368.3721 1386.9315 1401.1358 1405.7922 1455.6586 1461.1492 1466.4576 1472.9645 1482.0828 1486.1299 1487.6964 1496.4575 1564.5492 1585.8159 1607.3817 1622.6069 1634.8141 2957.9393 2981.2304 2997.3515 3017.4409 3017.4449 3094.8189 3096.9458 3106.6739 3130.0998 3134.3112 3174.0234 3183.8902 3188.7686 3191.9935 3212.8273
redmass: 2.4692 4.7092 4.5967 5.7532 5.0180 3.9960 2.1093 4.7807 4.4776 5.8893 6.3116 3.8944 3.1633 5.4422 1.4394 5.0344 4.0172 4.3764 5.7157 4.8289 2.8944 3.4194 5.9199 5.3915 6.3873 6.2666 5.7532 4.3918 5.9214 3.5621 9.7582 4.0100 6.1367 2.7999 6.7776 1.2335 6.0738 1.3946 1.3722 4.9507 1.1061 10.9525 1.6000 4.1151 1.4247 1.3551 1.3687 3.6074 2.6879 1.6338 4.5042 2.5632 3.7195 1.4554 2.7498 2.1483 1.0368 1.4994 1.4359 1.7551 1.7309 1.6955 2.1884 1.6157 1.1413 3.0325 2.9782 1.4721 2.0182 1.4825 1.4106 3.4295 1.3440 2.5810 4.5155 1.0398 3.1354 1.4754 1.5246 1.4626 1.5794 1.5657 5.3583 7.2548 7.0854 8.2376 6.5596 1.0553 1.0860 1.0363 1.1057 1.0551 1.0989 1.1191 1.1014 1.0887 1.0900 1.0934 1.0952 1.0927 1.0927 1.0618
irintensity: 14.2667 2.5164 0.0026 0.6794 1.0752 0.7993 1.2757 0.1654 2.4253 0.2106 5.8265 1.8081 0.0031 1.7495 0.8465 7.5365 1.4580 0.0179 1.5468 2.4843 0.5639 10.9164 26.0155 35.1561 31.3709 6.4687 6.3861 7.4586 0.2672 11.2451 0.4574 0.9883 5.7250 0.0272 4.8104 49.3862 13.2573 103.2588 41.0894 14.4952 0.1607 19.9127 38.1143 9.6446 20.0418 1.0386 12.4290 11.2323 51.3045 24.1537 180.3388 80.8659 17.0950 4.3101 135.5933 22.1358 0.0153 35.5485 4.5192 234.5199 38.9456 28.2419 103.0810 202.9887 0.0401 168.0138 413.3333 46.3464 82.7468 3.9068 36.6488 59.8638 60.6409 29.9374 105.5686 11.9784 197.7448 50.4177 13.5907 19.1052 83.1875 49.3512 32.1848 49.8506 2.4265 1.9837 388.1160 44.2117 49.7840 35.7947 39.3531 154.0548 30.0544 29.8111 34.3929 6.0679 8.8696 18.6787 8.5067 0.7559 5.0675 147.3265
temp: 298.150 k
press: 1.00000 atm
elementType: 8 8 8 8 7 6 6 6 6 6 6 6 6 6 6 6 6 6 6 6 6 1 1 1 1 1 1 1 1 1 1 1 1 1 1 1
symmnumber: 1
zpe: 724412.0 jmol-1
zpe.correction: 0.275914 hartree
zpe.thermalcorrener: 0.293934 hartree
zpe.thermalcorrenthalpy: 0.294878 hartree
zpe.thermalcorrgfe: 0.227874 hartree
zpe.sumelectzpe: -972.801782 hartree
zpe.sumelectthermal: -972.783762 hartree
zpe.sumelectthermalent: -972.782818 hartree
zpe.sumelectthermalfe: -972.849822 hartree
dipole: -0.6189 -4.1278 -0.0049
dipole: 4.1739
quadrupole: -85.7280 -118.3158 -126.4011
quadrupole: -17.3204 0.0386 0.0139
quadrupole: 24.4203 -8.1675 -16.2528 -17.3204 0.0386 0.0139
hfenergy: -973.0776961 hartree
pointgroup: C01 [X(C16H15N1O4)]
dipole: 0.2388843 -1.1358124 -1.1616689 debye
polarizability: 503.4906613|-15.9898156|138.8023269|6.3063157|51.2462211|141.9898477 unknown
InChI: InChI=1S/C16H15NO4/c1-2-19-12-4-5-13(14(18)8-12)17-9-11-3-6-15-16(7-11)21-10-20-15/h3-9,18H,2,10H2,1H3
charge 0 multiplicity 1
36 atoms
O  5.027833 1.124836 1.32279
O  6.34591 -0.306028 -0.086719
O  -5.715006 0.585894 0.177958
O  -1.33363 1.806461 1.708372
N  -0.100442 0.168231 0.066832
C  4.188827 0.350728 0.483134
C  4.971276 -0.491309 -0.345498
C  2.173952 -0.513893 -0.513023
C  2.801413 0.367145 0.428656
C  4.387295 -1.360406 -1.270693
C  2.971028 -1.35704 -1.340438
C  6.418135 0.726038 0.987592
C  -1.508485 0.144118 -0.036901
C  0.716355 -0.570693 -0.650731
C  -4.333481 0.394375 0.059425
C  -2.147082 1.056035 0.877653
C  -2.327863 -0.63143 -0.894719
C  -3.543371 1.182915 0.928745
C  -3.73062 -0.516655 -0.856819
C  -6.609707 -0.207328 -0.690232
C  -8.037039 0.204853 -0.34075
H  2.197266 1.015603 1.065983
H  4.995483 -2.007482 -1.907017
H  2.473567 -2.024499 -2.053696
H  6.892228 0.279576 1.878281
H  6.963794 1.603467 0.601119
H  0.34409 -1.287686 -1.40888
H  -1.875691 -1.334877 -1.603369
H  -4.018074 1.877173 1.625257
H  -4.33995 -1.125526 -1.529365
H  -6.377793 0.007634 -1.753503
H  -6.443678 -1.287582 -0.500731
H  -8.758045 -0.358081 -0.961016
H  -8.25251 -0.001047 0.721498
H  -8.185694 1.282982 -0.521679
H  -0.396989 1.515302 1.457886
