program: Gaussian 09
title: 000277025
version: EM64L-G09RevD.01
frameworkgroup: C1[X(C14H31NO)]
method: RPBEPBE
basis: SDD
operation: Freq
keyword: #p
keyword: freq=noraman
keyword: PBEPBE/SDD
title: #p freq=noraman PBEPBE/SDD
converged: YES YES NO NO
title: Mulliken charges:
elementType: O N C C C C C C C C C C C C C C H H H H H H H H H H H H H H H H H H H H H H H H H H H H H H H
charge: -0.452452 -0.361908 -0.004663 -0.493041 -0.440812 -0.404808 -0.396762 -0.036092 -0.037711 -0.386085 -0.718472 -0.712538 -0.717259 -0.714322 -0.052497 -0.694906 0.179736 0.242668 0.186592 0.223537 0.196345 0.192144 0.209550 0.195562 0.228374 0.196738 0.194101 0.250646 0.202673 0.194815 0.211878 0.210507 0.218677 0.212653 0.207352 0.212706 0.210189 0.208923 0.217771 0.211519 0.213854 0.200766 0.199254 0.241817 0.221940 0.199253 0.331786
chargesum: 0.00000
title: Mulliken charges with hydrogens summed into heavy atoms:
elementType: O N C C C C C C C C C C C C C C
charge: -0.120666 -0.111262 0.175073 -0.063781 -0.020930 -0.003114 0.027174 0.160646 0.156390 0.011404 -0.077410 -0.079827 -0.080375 -0.088183 0.146757 -0.031896
polarizability: 1.83577106e+02 1.57296816e+00 1.69893296e+02 -1.22285805e+00 -1.42132161e+00 1.37918367e+02
1716.lowfreq: -13.6629 -0.0007 -0.0006 0.0006 7.3920 11.9084 24.4881 26.5648 32.6540
frequency: 24.2197 25.9690 31.4970 38.5167 43.0642 61.1590 90.7668 103.9541 110.6150 163.2164 174.5158 182.4006 195.3444 212.6505 219.2220 220.6991 231.3539 234.1765 245.6610 277.1638 304.7653 323.1100 354.3141 361.7462 363.9203 373.1262 397.8902 428.0323 457.2941 484.1405 521.5076 557.1260 592.5158 671.6856 757.2814 764.7594 789.4235 800.7865 829.9991 851.4070 905.8154 912.0253 913.7966 918.7786 936.4768 942.4207 954.0618 959.7156 964.0766 980.0080 1004.8700 1009.7278 1036.3808 1064.6135 1077.0788 1089.7367 1092.1630 1121.5217 1129.4571 1140.7055 1156.5014 1163.5942 1191.2947 1193.0018 1198.7362 1210.1452 1222.3768 1247.6425 1254.4939 1271.8698 1285.7237 1287.8730 1290.4155 1314.9421 1319.2023 1333.6636 1336.6560 1338.2946 1342.6676 1361.6080 1368.9711 1374.3248 1375.3808 1375.8137 1377.5850 1391.7686 1393.7287 1402.2376 1456.4973 1459.0730 1463.4895 1464.6138 1466.8522 1467.0911 1471.9064 1475.2089 1476.4847 1479.8705 1483.2218 1484.9607 1485.9926 1487.0658 1489.3026 1491.2696 2827.5640 2871.0894 2948.1286 2949.7155 2962.3144 2962.9038 2965.7907 2965.9048 2967.1407 2969.2842 2971.7890 2973.6632 2988.1858 2989.3850 2999.0807 3007.3660 3016.2888 3038.9552 3041.5529 3059.2535 3061.5533 3063.0824 3064.7233 3066.1573 3066.7188 3067.6456 3070.7258 3086.3509 3096.9475 3431.5961 3551.5135
redmass: 3.3000 2.7643 3.4410 2.7287 2.9108 3.6394 2.5513 2.2630 2.3265 3.3302 2.5037 2.0634 1.5441 1.2255 1.2482 1.5188 1.3795 1.1355 1.6644 2.2502 1.4508 1.9463 2.0222 2.0352 2.1634 2.2004 2.4335 2.6094 2.3908 2.9113 2.7798 2.2524 2.2864 1.4739 1.3094 1.5099 3.0097 2.2441 2.6585 2.5466 1.3217 1.2587 1.2200 2.2323 1.6427 1.4933 2.1054 1.4972 1.8141 1.9091 1.9178 1.9583 1.8503 2.0191 1.7945 1.3327 2.0118 2.1903 1.7921 2.2677 2.3268 2.3206 1.8803 1.9100 1.4337 1.2982 1.3287 1.2769 1.3360 1.3335 1.1440 1.2224 1.2302 1.3975 1.4523 1.4402 1.4273 1.3759 1.3519 1.4036 1.4578 1.2455 1.3543 1.3668 1.2221 1.2174 1.2157 1.5177 1.1378 1.0748 1.0730 1.0472 1.0522 1.0833 1.0724 1.0635 1.0750 1.0752 1.0752 1.0622 1.0537 1.0565 1.0582 1.0740 1.0813 1.0692 1.0681 1.0742 1.0824 1.0653 1.0443 1.0544 1.0587 1.0357 1.0520 1.0411 1.0366 1.0622 1.0872 1.0962 1.0968 1.0996 1.1011 1.0996 1.0998 1.0998 1.0994 1.0991 1.0985 1.0989 1.0985 1.0998 1.0991 1.0735 1.0659
irintensity: 0.1953 0.3225 0.1589 0.0150 0.0321 0.3515 0.9336 1.0512 0.9877 0.3401 0.4464 1.1501 3.2188 2.7516 0.0724 5.6637 0.5103 0.3755 0.1296 0.3404 60.7784 86.5259 0.4488 0.1185 0.6117 0.1652 5.2684 11.8638 19.6809 4.6814 2.0134 9.2735 6.7438 52.3219 7.2620 8.0431 1.7942 0.7877 4.2060 4.5775 7.3843 1.5997 2.1239 25.8957 4.9037 4.6097 0.7415 0.8603 3.9065 3.0363 1.1382 3.2195 4.4823 49.8157 10.2254 0.4075 5.1847 38.0375 2.3936 21.4297 23.0724 5.6975 5.4126 12.4941 8.9472 23.6407 46.1223 22.9985 17.9395 12.2285 0.6676 3.1647 4.7380 7.6445 0.7201 6.6392 2.2501 1.2961 3.1250 3.8229 10.7448 20.3916 14.0715 13.1991 24.3333 18.6707 14.3222 22.9239 26.6019 0.4374 0.6420 2.2198 2.1401 3.0931 10.3342 2.3479 2.5058 9.7974 19.9104 20.4790 14.8489 4.3458 28.9042 9.5593 80.4791 87.1953 12.2757 18.0788 48.9385 2.7659 7.9193 58.2172 113.3194 48.0972 11.1490 12.4367 16.5278 32.5901 54.5157 18.7647 1.7210 71.9346 69.3176 7.2229 31.9039 22.3675 9.4608 76.4148 105.5589 63.1320 108.1549 39.4861 31.3602 1.9968 6.4837
temp: 298.150 k
press: 1.00000 atm
elementType: 8 7 6 6 6 6 6 6 6 6 6 6 6 6 6 6 1 1 1 1 1 1 1 1 1 1 1 1 1 1 1 1 1 1 1 1 1 1 1 1 1 1 1 1 1 1 1
symmnumber: 1
zpe: 1125148.9 jmol-1
zpe.correction: 0.428547 hartree
zpe.thermalcorrener: 0.450292 hartree
zpe.thermalcorrenthalpy: 0.451236 hartree
zpe.thermalcorrgfe: 0.376015 hartree
zpe.sumelectzpe: -680.678141 hartree
zpe.sumelectthermal: -680.656396 hartree
zpe.sumelectthermalent: -680.655452 hartree
zpe.sumelectthermalfe: -680.730673 hartree
dipole: -1.7708 0.7903 -0.2885
dipole: 1.9605
quadrupole: -112.3608 -106.1006 -104.6645
quadrupole: 8.9345 0.4685 -1.6131
quadrupole: -4.6522 1.6081 3.0441 8.9345 0.4685 -1.6131
hfenergy: -681.1066877 hartree
pointgroup: C01 [X(C14H31N1O1)]
dipole: 0.7150387 0.2682614 0.1079894 debye
polarizability: 183.3099371|-2.3133062|170.0723031|-1.7674332|1.983379|138.0065286 unknown
InChI: InChI=1S/C14H31NO/c1-11(2)6-8-14(9-7-12(3)4)15-10-13(5)16/h11-16H,6-10H2,1-5H3
charge 0 multiplicity 1
47 atoms
O  -4.775396 -1.377967 0.45262
N  -1.045694 -0.98701 -0.08705
C  0.121372 -0.435772 0.658196
C  1.416239 -0.915363 -0.047036
C  0.020904 1.111615 0.781265
C  2.713369 -0.465662 0.663857
C  0.053619 1.856933 -0.572854
C  4.026242 -1.109217 0.129703
C  -0.364188 3.355116 -0.519763
C  -2.3314 -1.017052 0.638788
C  4.263297 -0.797721 -1.368244
C  4.090164 -2.633416 0.394992
C  0.543872 4.185673 0.420049
C  -1.856959 3.538884 -0.149708
C  -3.497304 -1.420732 -0.293621
C  -3.392161 -2.853249 -0.825766
H  0.14712 -0.841224 1.70444
H  1.406295 -0.560181 -1.09463
H  1.388494 -2.024822 -0.088414
H  0.841321 1.458929 1.438424
H  -0.915683 1.356028 1.319787
H  2.626697 -0.693065 1.747627
H  2.808465 0.635998 0.581151
H  1.077209 1.798605 -0.998141
H  -0.613782 1.316587 -1.273224
H  4.856121 -0.641543 0.701931
H  -0.231534 3.753125 -1.548915
H  -0.819552 -1.915441 -0.469976
H  -2.334076 -1.7023 1.523443
H  -2.534255 0.002322 1.024275
H  4.218653 0.290426 -1.56437
H  5.255407 -1.161536 -1.69481
H  3.502991 -1.288224 -2.004039
H  3.9276 -2.861267 1.465384
H  3.325941 -3.179844 -0.188959
H  5.077724 -3.039809 0.106796
H  1.61097 4.070951 0.150022
H  0.293115 5.261858 0.366185
H  0.424604 3.867726 1.472846
H  -2.158132 4.599283 -0.242781
H  -2.508007 2.939155 -0.81363
H  -2.055488 3.230809 0.894113
H  -3.522407 -0.705136 -1.14371
H  -4.29541 -3.102967 -1.40789
H  -3.314257 -3.56931 0.012359
H  -2.515351 -2.96946 -1.488198
H  -4.915462 -0.458531 0.795679
