program: Gaussian 09
title: 000276993
version: EM64L-G09RevD.01
frameworkgroup: C1[X(C11H25NO)]
method: RPBEPBE
basis: SDD
operation: Freq
keyword: #p
keyword: freq=noraman
keyword: PBEPBE/SDD
title: #p freq=noraman PBEPBE/SDD
converged: YES YES NO NO
title: Mulliken charges:
elementType: O N C C C C C C C C C C C H H H H H H H H H H H H H H H H H H H H H H H H H
charge: -0.459130 -0.323525 -0.041188 -0.431618 -0.351626 -0.426999 0.286555 -0.346560 -0.722575 -0.358506 -0.724338 -0.721431 -0.695994 0.198910 0.185789 0.192896 0.179601 0.216329 0.222166 0.189662 0.245376 0.185293 0.182058 0.215201 0.229189 0.204497 0.194259 0.196136 0.235044 0.207491 0.223655 0.190899 0.225855 0.240775 0.322570 0.209369 0.214926 0.208989
chargesum: 0.00000
title: Mulliken charges with hydrogens summed into heavy atoms:
elementType: O N C C C C C C C C C C C
charge: -0.136559 -0.078149 0.157721 -0.052933 0.044305 -0.015171 0.286555 0.020790 -0.073687 0.031889 -0.058148 -0.063902 -0.062710
polarizability: 1.51119599e+02 1.13063878e+00 1.30916353e+02 -1.42004732e+00 -1.04797424e-01 1.15404734e+02
1716.lowfreq: -13.9897 0.0001 0.0003 0.0006 4.1503 11.8685 28.3536 31.0565 44.2003
frequency: 28.0738 30.2289 44.1671 61.2403 82.2229 101.5516 117.7882 134.0538 177.5714 194.3866 201.4593 223.3712 225.5964 229.2250 241.6998 284.6766 292.6581 311.0325 330.1248 360.8455 415.3618 421.4490 437.0754 483.5213 492.7668 524.5052 668.5805 724.3920 745.4421 750.7462 819.4911 848.3064 869.6207 889.6430 909.9649 924.4693 935.8429 942.8187 977.0734 992.9962 1000.2307 1023.8810 1045.4500 1064.0693 1079.3926 1090.8909 1112.4977 1117.1927 1151.9669 1160.8468 1169.8093 1196.5182 1228.9431 1234.1461 1253.9003 1270.1215 1282.3256 1285.0419 1293.7945 1317.0068 1321.9088 1337.7850 1347.6083 1351.5280 1362.7318 1374.5408 1378.1866 1387.7167 1391.2991 1440.1511 1455.3155 1459.3254 1463.7146 1465.1574 1467.6194 1469.6891 1472.6745 1475.5826 1476.1658 1481.7838 1483.6161 1486.4569 1489.2469 2904.2209 2945.0537 2948.7063 2959.1714 2963.9493 2966.2278 2969.2792 2969.9178 2970.9720 2988.8043 2989.6823 2993.9416 3005.5779 3019.2590 3042.8325 3060.6729 3063.7313 3067.4753 3069.0038 3069.8223 3089.3733 3093.4784 3099.2294 3424.5209 3541.4712
redmass: 3.0347 3.7287 1.9906 2.0885 2.8237 2.9950 2.0563 2.0661 2.3362 1.7819 1.1207 1.4831 1.5739 1.1174 1.5241 3.0515 1.1933 2.6239 2.0997 2.4631 2.5456 2.7265 2.5271 2.5744 2.3591 2.8876 1.5825 1.0693 3.6159 1.1653 1.3495 1.7440 2.8080 1.8829 1.6114 1.6015 1.3759 1.2527 1.8651 2.5367 1.7091 1.4034 2.3526 2.3613 2.2386 1.5328 2.4586 2.5392 1.7514 2.3303 1.9336 1.5324 1.7087 1.3593 1.7594 1.4199 1.1803 1.1857 1.1673 1.3719 1.2678 1.5960 1.5520 1.6959 1.3014 1.3975 1.2208 1.2171 1.3047 1.1442 1.0622 1.0769 1.0644 1.0632 1.0743 1.0665 1.0669 1.0674 1.0430 1.0755 1.0715 1.0649 1.0889 1.0648 1.0633 1.0599 1.0670 1.0461 1.0610 1.0569 1.0472 1.0368 1.0959 1.0371 1.0924 1.0954 1.1025 1.1024 1.0992 1.0949 1.1007 1.0993 1.0992 1.0997 1.1004 1.0994 1.0737 1.0657
irintensity: 0.5449 0.0635 0.2754 0.4941 1.1981 0.0075 0.2261 0.3269 1.2696 0.6350 3.3282 0.1771 4.6753 0.0244 3.5768 0.8756 74.4093 47.0771 8.8482 3.2595 1.2706 5.3096 9.9183 7.4270 6.7259 9.1241 84.3709 12.4813 3.4336 0.4100 4.2534 8.7520 22.0520 2.7096 3.7101 1.6019 3.8601 1.3267 22.8317 3.8729 6.5563 3.3583 0.0779 3.5683 1.0847 21.7566 22.3967 34.7439 148.4290 25.7231 1.1630 0.4715 10.7472 2.0733 15.7054 8.2247 1.6316 1.0707 1.1946 3.0134 4.9818 18.3276 3.0032 2.8577 7.0799 39.2572 22.9090 11.6366 24.6107 31.1493 3.5604 4.1883 0.2772 0.6349 4.9034 4.7591 0.6777 19.2560 11.7194 4.3847 5.3470 7.8250 17.3843 69.8063 1.7817 15.8593 2.3152 21.2428 11.9050 59.9977 113.3663 34.4664 5.4665 25.6971 31.6189 15.9255 3.9234 70.4118 52.5759 36.4474 98.8319 53.8741 54.3486 31.2455 0.8194 50.8388 0.6507 5.9286
temp: 298.150 k
press: 1.00000 atm
elementType: 8 7 6 6 6 6 6 6 6 6 6 6 6 1 1 1 1 1 1 1 1 1 1 1 1 1 1 1 1 1 1 1 1 1 1 1 1 1
symmnumber: 1
zpe: 902464.3 jmol-1
zpe.correction: 0.343730 hartree
zpe.thermalcorrener: 0.361690 hartree
zpe.thermalcorrenthalpy: 0.362635 hartree
zpe.thermalcorrgfe: 0.296924 hartree
zpe.sumelectzpe: -563.020359 hartree
zpe.sumelectthermal: -563.002399 hartree
zpe.sumelectthermalent: -563.001455 hartree
zpe.sumelectthermalfe: -563.067166 hartree
dipole: -1.3218 1.0634 -0.7194
dipole: 1.8427
quadrupole: -97.7260 -84.6257 -79.4988
quadrupole: 2.0479 -4.1979 0.0837
quadrupole: -10.4425 2.6578 7.7847 2.0479 -4.1979 0.0837
hfenergy: -563.3640899 hartree
pointgroup: C01 [X(C11H25N1O1)]
dipole: -0.5281132 -0.3900926 0.3073898 debye
polarizability: 151.0643236|-1.3682295|130.8758481|1.643066|-1.1531089|115.5005145 unknown
InChI: InChI=1S/C11H25NO/c1-5-6-7-8-10(2)12-9-11(3,4)13/h10,12-13H,5-9H2,1-4H3
charge 0 multiplicity 1
38 atoms
O  4.38662 0.849753 0.330298
N  0.959695 -0.654828 -0.276172
C  0.110638 -1.681643 0.387194
C  -1.353714 -1.524786 -0.090299
C  -2.01604 -0.196417 0.335562
C  2.345499 -0.517517 0.2188
C  2.953654 0.88497 -0.079438
C  -3.435307 -0.013594 -0.245759
C  0.612729 -3.137203 0.177331
C  -4.116301 1.299574 0.204771
C  3.005196 1.168488 -1.588794
C  2.204865 1.99197 0.686483
C  -5.530259 1.481573 -0.388069
H  0.143198 -1.456893 1.474409
H  -1.378989 -1.614037 -1.198656
H  -1.945545 -2.377345 0.300499
H  -2.06666 -0.15428 1.444203
H  -1.364086 0.641303 0.020094
H  3.055778 -1.273228 -0.191389
H  2.321576 -0.662067 1.319155
H  0.931402 -0.766717 -1.299907
H  -3.383343 -0.034531 -1.354996
H  -4.072643 -0.87405 0.049955
H  0.010275 -3.855179 0.765358
H  1.668165 -3.246489 0.487557
H  0.538313 -3.425286 -0.88961
H  -4.173249 1.317738 1.312519
H  -3.477606 2.158435 -0.086515
H  3.558211 2.1053 -1.773665
H  1.986685 1.27595 -2.001656
H  3.531209 0.353141 -2.117204
H  2.295245 1.844671 1.781289
H  2.615181 2.986009 0.435952
H  1.130883 1.96137 0.432845
H  4.42777 0.780301 1.319067
H  -5.496564 1.50097 -1.493921
H  -5.995088 2.42525 -0.04751
H  -6.195391 0.649521 -0.088385
