program: Gaussian 09
title: 000276977
version: EM64L-G09RevD.01
frameworkgroup: C1[X(C10H23NO)]
method: RPBEPBE
basis: SDD
operation: Freq
keyword: #p
keyword: freq=noraman
keyword: PBEPBE/SDD
title: #p freq=noraman PBEPBE/SDD
converged: YES YES NO NO
title: Mulliken charges:
elementType: O N C C C C C C C C C C H H H H H H H H H H H H H H H H H H H H H H H
charge: -0.438239 -0.308483 -0.053323 -0.395977 -0.431152 -0.367832 -0.352981 -0.352736 -0.411730 -0.691329 -0.700021 -0.309837 0.202797 0.197381 0.193282 0.192223 0.190541 0.238355 0.184949 0.218143 0.230484 0.185542 0.204329 0.177055 0.206017 0.206001 0.215825 0.208413 0.210474 0.205817 0.207977 0.215382 0.211681 0.180420 0.330551
chargesum: 0.00000
title: Mulliken charges with hydrogens summed into heavy atoms:
elementType: O N C C C C C C C C C C
charge: -0.107688 -0.070127 0.149474 -0.005313 -0.048388 0.035261 0.063045 0.028647 0.000288 -0.056617 -0.070845 0.082263
polarizability: 1.33705224e+02 -6.37510622e-01 1.27086024e+02 4.60252568e-01 1.20875655e+00 1.01708426e+02
1716.lowfreq: -10.5159 -7.7309 -6.7082 0.0005 0.0006 0.0007 22.9016 45.7929 55.5511
frequency: 22.6415 45.7514 55.5040 62.6984 68.8207 80.7275 98.9347 115.6497 129.4781 197.7731 215.8317 228.1102 235.4838 239.3680 267.7443 301.0741 325.9382 342.5896 409.1653 458.7782 523.7579 593.8559 662.2589 735.2216 742.9548 775.6568 828.3703 846.3163 850.6788 872.6308 899.5228 942.1703 954.6245 993.4604 1011.4624 1044.7457 1051.7267 1056.5432 1057.4552 1069.9191 1082.4836 1118.1742 1122.4511 1138.2435 1161.7125 1187.0027 1224.5364 1234.6170 1243.7598 1260.0687 1273.9682 1279.1975 1281.3657 1290.0859 1296.3110 1319.9741 1322.5443 1339.6358 1349.0200 1362.3932 1381.5968 1384.5148 1387.9179 1388.3316 1441.7526 1461.7283 1465.2448 1466.7167 1473.2721 1475.2542 1475.8953 1478.2156 1480.4726 1484.9833 1487.3001 1494.6761 2855.1582 2944.5827 2946.3395 2955.5055 2961.5384 2967.1905 2968.6924 2971.2342 2972.4325 2978.6411 2988.2732 2998.9405 3009.6334 3026.3083 3035.2163 3037.4937 3067.6630 3068.0442 3068.3709 3070.1169 3071.8401 3427.6149 3559.3976
redmass: 3.5382 1.9922 3.1971 1.8549 2.1681 1.8752 2.7712 2.9918 2.1444 2.0364 2.8435 1.3575 1.2663 2.3316 2.7688 2.9243 1.2235 2.6538 2.9828 2.8724 2.6388 1.8469 2.2345 1.1364 1.1081 1.0825 2.1173 1.3907 1.3911 1.2087 1.6610 1.7667 4.5862 2.0348 1.6906 2.6842 2.2638 2.4038 2.5329 1.6898 1.8481 1.9725 2.7926 1.6415 2.3274 1.9755 1.3947 1.3136 1.3430 1.3133 1.2045 1.2298 1.1771 1.0968 1.1943 1.3182 1.3008 1.3038 1.5964 1.4899 1.3521 1.2990 1.2189 1.2167 1.1642 1.0782 1.1083 1.0757 1.0661 1.0432 1.0522 1.0433 1.0804 1.0784 1.0844 1.0881 1.0704 1.0724 1.0696 1.0620 1.0629 1.0636 1.0363 1.0401 1.0625 1.0605 1.0852 1.0978 1.0956 1.1019 1.0992 1.0996 1.1008 1.0999 1.0998 1.0994 1.0978 1.0734 1.0661
irintensity: 0.1890 2.5616 0.1664 0.6247 0.8940 0.1693 3.1682 1.7521 2.2737 1.6294 1.0914 0.8159 0.5236 4.0226 0.4703 3.0312 133.0531 31.0903 4.6721 8.3109 14.2214 50.6866 62.2245 11.3094 11.6117 6.3823 8.4440 0.8344 0.1589 2.9631 9.9849 9.0751 84.8819 28.0399 1.2429 1.6540 1.2660 14.3683 1.8138 17.9537 7.5597 23.6366 23.6239 7.0134 22.9369 11.5734 5.4073 4.9700 6.7031 6.2609 0.9885 6.5301 3.4703 0.3334 0.3737 6.7129 16.5757 2.0957 5.4168 0.4105 0.8219 31.4749 14.7769 7.3805 19.3656 8.6723 4.6220 1.2092 3.1491 13.7333 2.1515 11.5378 2.1185 16.7843 10.1191 2.4850 92.6680 3.7581 60.3461 27.4247 10.1603 44.4732 54.4087 54.6654 54.0779 30.3672 34.8654 3.4954 31.7985 51.1573 31.0988 11.6892 60.6062 66.4828 87.9242 54.8127 61.4399 2.0360 6.6613
temp: 298.150 k
press: 1.00000 atm
elementType: 8 7 6 6 6 6 6 6 6 6 6 6 1 1 1 1 1 1 1 1 1 1 1 1 1 1 1 1 1 1 1 1 1 1 1
symmnumber: 1
zpe: 834281.9 jmol-1
zpe.correction: 0.317761 hartree
zpe.thermalcorrener: 0.334277 hartree
zpe.thermalcorrenthalpy: 0.335221 hartree
zpe.thermalcorrgfe: 0.271746 hartree
zpe.sumelectzpe: -523.783112 hartree
zpe.sumelectthermal: -523.766596 hartree
zpe.sumelectthermalent: -523.765651 hartree
zpe.sumelectthermalfe: -523.829127 hartree
dipole: 1.7448 -0.0268 0.7453
dipole: 1.8975
quadrupole: -93.1564 -76.7607 -76.8708
quadrupole: 5.5131 -4.0876 -0.2875
quadrupole: -10.8938 5.5019 5.3918 5.5131 -4.0876 -0.2875
hfenergy: -524.1008729 hartree
pointgroup: C01 [X(C10H23N1O1)]
dipole: 0.6876286 0.0510533 0.2861592 debye
polarizability: 133.7693328|0.0508718|126.947179|-0.0560307|1.879201|101.7831621 unknown
InChI: InChI=1S/C10H23NO/c1-3-6-10(7-4-2)11-8-5-9-12/h10-12H,3-9H2,1-2H3
charge 0 multiplicity 1
35 atoms
O  -5.092468 -1.086333 -0.438511
N  -0.171648 -0.332008 -0.114312
C  1.035153 0.123706 0.626102
C  1.158025 1.673644 0.786807
C  2.293014 -0.502247 -0.029019
C  1.26691 2.465499 -0.537093
C  2.370942 -2.035457 0.1416
C  -1.484019 0.000639 0.473555
C  -2.617511 -0.730255 -0.276712
C  1.289689 3.993062 -0.31131
C  3.572557 -2.663116 -0.596202
C  -4.007296 -0.434015 0.314035
H  0.945869 -0.299595 1.650466
H  0.279604 2.048702 1.352419
H  2.045173 1.892389 1.416841
H  3.197266 -0.032185 0.409018
H  2.307536 -0.254949 -1.11199
H  -0.122736 -0.074495 -1.11077
H  0.409607 2.208493 -1.193787
H  2.181766 2.162698 -1.083536
H  1.42263 -2.475122 -0.220811
H  2.43406 -2.274686 1.223389
H  -1.468898 -0.32618 1.533581
H  -1.7086 1.097325 0.485544
H  -2.61894 -0.431423 -1.344285
H  -2.411128 -1.819158 -0.245635
H  1.364499 4.543736 -1.267177
H  0.370349 4.330971 0.203463
H  2.15138 4.287613 0.317066
H  4.530227 -2.239784 -0.23694
H  3.512088 -2.474907 -1.685171
H  3.611103 -3.757969 -0.446129
H  -4.242784 0.642035 0.245931
H  -4.039596 -0.729147 1.386227
H  -4.928624 -2.063381 -0.446357
