program: Gaussian 09
title: 000276985
version: EM64L-G09RevD.01
frameworkgroup: C1[X(C11H25NO)]
method: RPBEPBE
basis: SDD
operation: Freq
keyword: #p
keyword: freq=noraman
keyword: PBEPBE/SDD
title: #p freq=noraman PBEPBE/SDD
converged: YES YES NO NO
title: Mulliken charges:
elementType: O N C C C C C C C C C C C H H H H H H H H H H H H H H H H H H H H H H H H H
charge: -0.441235 -0.365637 0.014089 -0.503669 -0.389382 -0.407896 -0.350361 -0.364365 -0.367148 -0.359495 -0.701336 -0.335815 -0.692619 0.195369 0.231631 0.200983 0.192055 0.184346 0.199769 0.184082 0.249004 0.194937 0.189405 0.228288 0.207296 0.195792 0.206503 0.195415 0.204988 0.214968 0.206850 0.204405 0.205514 0.206283 0.209859 0.215518 0.208579 0.333029
chargesum: 0.00000
title: Mulliken charges with hydrogens summed into heavy atoms:
elementType: O N C C C C C C C C C C C
charge: -0.108206 -0.116632 0.209458 -0.071055 -0.012981 -0.024046 0.033981 0.071219 0.035147 0.040908 -0.075113 0.075982 -0.058662
polarizability: 1.45438923e+02 1.34361276e+00 1.31668947e+02 -1.72171381e+00 -1.27695511e+00 1.16267795e+02
1716.lowfreq: -7.3515 -0.0011 -0.0010 -0.0009 7.0958 12.9656 23.3534 34.5811 37.0119
frequency: 22.5784 34.5573 36.9039 44.1309 63.1876 76.5214 89.7817 103.0873 131.3583 178.1672 192.9795 200.6148 239.6537 243.4195 275.3071 291.5615 299.0520 321.4526 351.5214 389.5647 414.0331 463.0982 516.2336 601.0241 663.8304 714.9115 741.4786 758.1037 812.4379 819.7444 838.3774 858.1549 871.0919 907.2145 934.3129 967.2927 978.1436 999.5780 1033.3810 1044.8107 1054.6980 1065.2392 1069.2976 1076.5471 1102.4119 1110.1626 1124.5148 1132.6992 1163.6332 1172.5426 1214.2766 1222.4717 1234.2613 1254.4494 1270.3812 1279.8957 1283.9634 1286.4712 1293.3411 1299.1169 1316.6020 1333.0664 1345.0497 1350.4871 1358.2158 1364.8879 1370.4366 1386.8239 1389.2282 1390.2830 1456.3625 1460.4362 1463.3056 1469.0115 1473.2408 1475.9657 1477.0198 1478.3586 1479.2961 1480.4758 1486.8399 1487.8010 1491.9344 2844.1716 2883.3650 2952.8049 2959.2552 2963.7456 2967.3516 2970.6058 2972.6317 2978.4472 2978.7890 2984.6706 2997.2557 2998.6308 3003.4150 3010.3684 3031.4232 3035.6998 3041.8256 3065.3596 3066.8020 3067.1655 3069.4297 3071.8524 3435.6519 3563.4957
redmass: 3.8512 3.2785 3.0666 1.7361 1.6941 1.7575 3.0235 4.0307 3.0367 2.5060 2.7492 2.4020 1.2004 1.1805 2.0568 2.4320 2.1701 1.3447 2.5308 2.5977 2.7251 2.2886 2.9014 1.9371 1.9399 1.2473 1.1261 1.3502 1.1305 2.3602 1.7943 1.3481 1.7881 1.6407 1.7786 3.0548 1.6876 1.8691 2.3007 2.9028 2.1898 1.5798 1.7459 1.6547 2.0295 2.6437 1.9963 2.0454 2.3312 1.4846 1.4046 1.4240 1.2875 1.3611 1.2083 1.2745 1.1224 1.1654 1.2207 1.2742 1.2278 1.3665 1.4849 1.3817 1.4650 1.3291 1.4439 1.3384 1.2303 1.2138 1.1568 1.1012 1.0830 1.0790 1.0767 1.0658 1.0512 1.0458 1.0434 1.1043 1.0798 1.0855 1.0901 1.0805 1.0692 1.0606 1.0599 1.0595 1.0361 1.0609 1.0370 1.0629 1.0639 1.0636 1.0894 1.0969 1.0952 1.0965 1.1026 1.1007 1.1003 1.1019 1.1005 1.1000 1.1006 1.0994 1.0737 1.0662
irintensity: 0.0561 0.1808 0.3851 3.4989 0.0753 0.8901 1.5594 1.4353 3.0851 3.0875 1.3345 1.2557 0.1802 0.7116 1.1644 0.4673 19.0813 109.5009 39.0516 5.4389 5.2044 10.3273 9.4088 44.5074 28.2886 14.5769 10.1961 2.8628 3.9556 3.1446 3.3552 0.5926 3.4840 1.5380 4.9462 105.0545 2.7947 2.5583 14.0358 0.7642 1.9775 2.5068 9.2253 12.6585 5.8738 16.7614 8.6967 29.2694 22.5045 21.6472 2.4367 0.7565 1.0503 1.2390 2.7019 3.9008 0.1140 0.4403 3.3999 3.4100 0.6536 17.9281 9.5898 4.2170 0.9683 1.5099 5.3665 11.4576 11.7759 11.1355 26.2633 5.6727 9.2855 5.5930 2.4241 6.0825 4.9320 8.8908 12.4334 14.8964 14.3400 9.6398 8.8990 85.4080 84.1974 28.6193 28.0609 17.6581 55.5870 59.6604 43.4069 5.6293 71.4476 25.9925 15.6667 18.1344 38.8017 38.1463 73.6177 7.0498 55.3166 45.1342 84.1989 61.6491 88.1895 53.2013 1.8034 7.0644
temp: 298.150 k
press: 1.00000 atm
elementType: 8 7 6 6 6 6 6 6 6 6 6 6 6 1 1 1 1 1 1 1 1 1 1 1 1 1 1 1 1 1 1 1 1 1 1 1 1 1
symmnumber: 1
zpe: 908757.4 jmol-1
zpe.correction: 0.346127 hartree
zpe.thermalcorrener: 0.363780 hartree
zpe.thermalcorrenthalpy: 0.364724 hartree
zpe.thermalcorrgfe: 0.298114 hartree
zpe.sumelectzpe: -563.002102 hartree
zpe.sumelectthermal: -562.984450 hartree
zpe.sumelectthermalent: -562.983506 hartree
zpe.sumelectthermalfe: -563.050116 hartree
dipole: -1.3062 1.3397 -0.2953
dipole: 1.8942
quadrupole: -86.2231 -95.2440 -82.4358
quadrupole: 6.8750 -4.2114 -1.6040
quadrupole: 1.7445 -7.2764 5.5318 6.8750 -4.2114 -1.6040
hfenergy: -563.3482296 hartree
pointgroup: C01 [X(C11H25N1O1)]
dipole: 0.4538749 -0.5620606 -0.1829975 debye
polarizability: 145.6671215|-0.0683925|131.2359041|0.6979547|2.404193|116.4726385 unknown
InChI: InChI=1S/C11H25NO/c1-3-5-6-8-11(7-4-2)12-9-10-13/h11-13H,3-10H2,1-2H3
charge 0 multiplicity 1
38 atoms
O  -3.611639 3.285793 -0.165296
N  -1.069985 0.588605 0.6085
C  -0.126231 -0.319913 -0.098791
C  0.924211 -0.853228 0.908888
C  -0.887168 -1.47921 -0.802178
C  1.966827 0.184896 1.402753
C  2.880249 0.791978 0.307357
C  -1.650836 -2.430058 0.146114
C  -1.833633 1.527838 -0.236883
C  3.741169 -0.246856 -0.448915
C  -2.524053 -3.44727 -0.619412
C  -2.885432 2.26853 0.611366
C  4.740536 0.410105 -1.425955
H  0.417938 0.236596 -0.905156
H  0.386941 -1.262855 1.786845
H  1.452074 -1.706016 0.440621
H  -0.152851 -2.056208 -1.402874
H  -1.607133 -1.052519 -1.531506
H  2.607157 -0.307958 2.163048
H  1.454132 1.012422 1.937758
H  -0.600961 1.084169 1.378818
H  2.272712 1.36243 -0.42418
H  3.556461 1.53142 0.784027
H  -2.277095 -1.818137 0.822974
H  -0.93237 -2.977377 0.78745
H  -2.352127 0.947239 -1.02592
H  -1.197123 2.283729 -0.75906
H  4.293231 -0.865608 0.288411
H  3.085421 -0.941962 -1.009605
H  -3.06121 -4.121784 0.072952
H  -1.910716 -4.075497 -1.293903
H  -3.280425 -2.931454 -1.241732
H  -3.574171 1.532149 1.073972
H  -2.398569 2.843828 1.418744
H  4.21206 1.019418 -2.183486
H  5.34264 -0.346754 -1.961665
H  5.43849 1.078949 -0.887585
H  -4.128619 2.835568 -0.880097
