program: Gaussian 09
title: 000276979
version: EM64L-G09RevD.01
frameworkgroup: C1[X(C10H23NO)]
method: RPBEPBE
basis: SDD
operation: Freq
keyword: #p
keyword: freq=noraman
keyword: PBEPBE/SDD
title: #p freq=noraman PBEPBE/SDD
converged: YES YES NO NO
title: Mulliken charges:
elementType: O N C C C C C C C C C C H H H H H H H H H H H H H H H H H H H H H H H
charge: -0.465621 -0.340908 -0.034650 -0.364657 -0.438612 0.236907 -0.372207 -0.358272 -0.715461 -0.729961 -0.701455 -0.699424 0.204867 0.222097 0.177009 0.195499 0.191079 0.256226 0.209108 0.203821 0.224816 0.186731 0.225891 0.196938 0.228337 0.228464 0.208130 0.243104 0.210160 0.218181 0.203464 0.207007 0.208143 0.214221 0.321027
chargesum: 0.00000
title: Mulliken charges with hydrogens summed into heavy atoms:
elementType: O N C C C C C C C C C C
charge: -0.144594 -0.084682 0.170217 0.034449 -0.052033 0.236907 0.040722 0.053276 -0.064296 -0.050263 -0.069649 -0.070053
polarizability: 1.33246088e+02 7.51679104e-01 1.27041903e+02 -1.09656812e-01 9.35348199e-03 1.04204616e+02
1716.lowfreq: -15.2120 -0.0002 0.0002 0.0006 6.4470 12.8773 20.5623 56.9626 58.5307
frequency: 20.4593 56.2921 58.3986 68.7426 79.8148 91.1367 169.7062 186.9921 220.6152 225.5847 226.7363 232.1278 269.4321 276.2374 279.0429 287.9084 310.6756 345.2127 365.5668 433.0771 444.6662 463.3091 557.0684 572.6378 651.4200 691.5753 736.1516 742.0522 805.9625 839.4551 851.3840 865.2408 900.8682 918.7294 946.1351 977.9013 997.9913 1015.7061 1046.2605 1050.9046 1058.8910 1079.4392 1089.9394 1125.2787 1141.8547 1145.9397 1167.1799 1210.4825 1240.0903 1247.3124 1257.2962 1282.7543 1294.3662 1301.3829 1319.7577 1332.0829 1341.2340 1353.2114 1367.5462 1376.8016 1386.1328 1387.5778 1392.6261 1445.8482 1452.4953 1460.2683 1461.9056 1468.4811 1474.2859 1474.3193 1474.9349 1476.6547 1481.4725 1483.9158 1485.9427 1494.7049 2953.9979 2958.2370 2968.5174 2968.6742 2969.1301 2972.8670 2980.8579 2983.6419 2990.4329 3010.8224 3018.6041 3035.2337 3042.3947 3064.6967 3066.6759 3067.6531 3071.6750 3075.6433 3084.2374 3091.3259 3101.4466 3469.8584 3520.1912
redmass: 3.4161 1.7219 3.1598 2.2481 2.0961 2.5502 2.9081 2.5732 1.6900 1.1577 1.6208 1.0404 1.7561 1.9352 1.1434 1.6367 2.4936 2.4796 2.7594 2.4797 1.9251 2.7103 2.4477 2.1683 3.7597 4.6443 1.1511 1.1236 2.1229 2.3146 1.3803 1.5354 1.6448 1.4773 1.6588 1.9775 1.3302 1.7561 1.6810 1.9836 2.2877 1.5056 1.8437 2.3836 2.3542 1.8100 2.3182 1.8630 1.6528 1.2813 1.3622 1.3392 1.1841 1.1583 1.3857 2.6559 1.3193 1.5800 1.4477 1.2539 1.2214 1.2183 1.2285 1.0953 1.0923 1.0622 1.0608 1.0728 1.0636 1.0608 1.0497 1.0430 1.0844 1.0657 1.0783 1.1682 1.0630 1.0624 1.0443 1.0390 1.0530 1.0587 1.0356 1.0803 1.0381 1.0948 1.0961 1.1006 1.0999 1.0998 1.1007 1.0991 1.1007 1.0996 1.0989 1.0998 1.1000 1.0737 1.0654
irintensity: 0.2124 0.1271 0.2814 0.0364 0.1819 0.1662 6.4740 0.6401 0.2416 0.2345 1.1481 0.1833 14.5141 2.4714 98.5764 3.3538 2.2993 5.7538 6.7103 13.5721 54.8502 0.8187 15.7494 58.5962 33.4592 53.4273 25.9928 8.6821 4.0268 8.8572 0.2836 1.1514 10.9494 0.3325 6.0255 1.3408 2.7091 0.7501 10.8976 1.7882 1.6611 62.6692 45.2409 26.7475 4.9302 17.6124 33.8364 10.4417 7.7208 4.2473 7.0941 10.5110 2.1786 2.9644 7.5231 121.0239 0.4974 3.2426 0.8358 35.5330 10.9372 7.3119 35.3778 6.4833 29.7228 2.3241 4.4645 2.1556 4.5529 4.9889 7.6651 12.2958 16.8268 12.7462 12.1003 13.8739 9.6766 27.1766 53.3962 71.8978 6.8114 33.7426 21.6797 38.9362 27.3553 25.4162 4.3138 17.7865 22.6580 48.5056 99.0997 55.4026 74.4827 19.1807 48.7064 29.3417 28.1463 0.6195 14.6201
temp: 298.150 k
press: 1.00000 atm
elementType: 8 7 6 6 6 6 6 6 6 6 6 6 1 1 1 1 1 1 1 1 1 1 1 1 1 1 1 1 1 1 1 1 1 1 1
symmnumber: 1
zpe: 830091.1 jmol-1
zpe.correction: 0.316165 hartree
zpe.thermalcorrener: 0.332650 hartree
zpe.thermalcorrenthalpy: 0.333594 hartree
zpe.thermalcorrgfe: 0.271900 hartree
zpe.sumelectzpe: -523.803602 hartree
zpe.sumelectthermal: -523.787117 hartree
zpe.sumelectthermalent: -523.786173 hartree
zpe.sumelectthermalfe: -523.847867 hartree
dipole: -0.4900 -1.4654 0.2381
dipole: 1.5634
quadrupole: -75.9238 -77.5251 -76.3420
quadrupole: 6.1040 -0.5202 -0.2824
quadrupole: 0.6731 -0.9281 0.2550 6.1040 -0.5202 -0.2824
hfenergy: -524.1197671 hartree
pointgroup: C01 [X(C10H23N1O1)]
dipole: -0.2333735 0.5646374 -0.0710567 debye
polarizability: 133.3213998|-0.3072603|126.9282087|0.1052644|0.933232|104.2429986 unknown
InChI: InChI=1S/C10H23NO/c1-5-7-9(8-6-2)11-10(3,4)12/h9,11-12H,5-8H2,1-4H3
charge 0 multiplicity 1
35 atoms
O  -2.600523 0.1708 0.194592
N  -0.257823 0.692381 0.425933
C  0.466178 -0.170115 -0.543532
C  -0.20525 -1.551679 -0.819959
C  1.933232 -0.319335 -0.060059
C  -1.543996 1.28184 0.148334
C  -0.315601 -2.485918 0.406578
C  2.748849 0.989546 -0.141872
C  -1.889344 2.28976 1.266753
C  -1.606562 1.935113 -1.248637
C  -1.059378 -3.797186 0.071514
C  4.176905 0.844355 0.426118
H  0.495832 0.379814 -1.506087
H  -1.225906 -1.371792 -1.207219
H  0.371509 -2.063256 -1.620486
H  2.426661 -1.104267 -0.6687
H  1.941548 -0.68996 0.986974
H  -0.199588 0.333802 1.386371
H  -0.865769 -1.957885 1.210333
H  0.692645 -2.725866 0.800128
H  2.199108 1.781676 0.401571
H  2.802828 1.315716 -1.201345
H  -1.857463 1.787296 2.250671
H  -2.905295 2.704171 1.129497
H  -1.168682 3.125831 1.272753
H  -0.787594 2.664142 -1.378847
H  -2.567103 2.467489 -1.373263
H  -1.539002 1.172837 -2.042531
H  -1.129134 -4.462249 0.9525
H  -2.087533 -3.581816 -0.274387
H  -0.542246 -4.353915 -0.733512
H  4.74542 0.063839 -0.114929
H  4.150683 0.557255 1.494693
H  4.742664 1.791009 0.345409
H  -3.496268 0.582665 0.070642
