program: Gaussian 09
title: 000276969
version: EM64L-G09RevD.01
frameworkgroup: C1[X(C10H21NO)]
method: RPBEPBE
basis: SDD
operation: Freq
keyword: #p
keyword: freq=noraman
keyword: PBEPBE/SDD
title: #p freq=noraman PBEPBE/SDD
converged: YES YES NO NO
title: Mulliken charges:
elementType: O N C C C C C C C C C C H H H H H H H H H H H H H H H H H H H H H
charge: -0.468164 -0.331866 -0.057203 -0.405742 -0.441540 -0.393959 -0.391624 -0.384955 -0.427553 0.275629 -0.723087 -0.735043 0.203469 0.177591 0.215900 0.218235 0.176604 0.197145 0.189901 0.192158 0.196941 0.198322 0.186927 0.239339 0.222323 0.218581 0.195870 0.244571 0.224501 0.229602 0.205956 0.221705 0.329467
chargesum: 0.00000
title: Mulliken charges with hydrogens summed into heavy atoms:
elementType: O N C C C C C C C C C C
charge: -0.138697 -0.092527 0.146266 -0.012250 -0.046701 -0.006914 -0.002525 0.000294 0.013351 0.275629 -0.058145 -0.077780
polarizability: 1.42276888e+02 -1.80160674e-01 1.08821805e+02 -6.97638133e-01 -3.83428986e-01 1.00995502e+02
1716.lowfreq: -10.3973 -6.9350 -0.0008 -0.0007 -0.0005 11.3905 32.5564 44.8108 76.4915
frequency: 29.9373 44.2249 76.1129 117.1467 184.4695 200.5014 217.2032 226.4244 250.6329 273.8283 280.8422 319.4745 325.5655 350.6649 415.3891 416.4035 434.3979 445.2161 481.1986 482.4335 571.8286 669.5376 741.4392 778.3854 789.6348 842.3513 868.7914 875.7262 890.7251 902.0968 917.1576 930.9681 959.7585 974.7829 1001.7091 1043.1598 1049.5865 1053.6348 1071.3656 1093.0512 1112.3576 1120.3663 1145.1935 1177.3474 1183.3016 1195.4231 1248.7627 1252.2057 1255.2710 1285.7167 1303.6988 1309.7520 1327.3695 1331.3253 1334.2603 1337.9616 1340.2800 1350.0249 1366.1728 1367.1093 1386.0877 1447.9931 1454.0090 1457.9856 1461.8969 1462.7747 1463.2655 1468.2299 1470.7429 1476.9838 1483.8149 1486.1857 2918.7138 2947.2299 2949.0871 2963.3689 2964.2867 2964.4433 2966.5875 2970.4611 2974.9739 3023.0503 3025.8557 3028.3925 3035.4444 3036.0740 3044.1640 3062.9308 3069.7965 3081.8900 3091.5565 3425.1692 3554.3088
redmass: 3.0249 3.1817 3.5968 2.5302 2.9334 2.2110 1.1252 1.9308 1.2640 1.1122 2.1695 1.8828 2.2015 2.2768 2.8693 2.6882 2.7733 2.4219 2.5250 2.0757 2.2355 1.4693 3.8233 1.5795 1.9867 2.0799 2.8672 1.6984 1.5262 1.7046 1.8938 1.4891 1.8929 1.8439 1.5673 1.7580 1.5839 1.3409 1.3791 1.5115 2.4887 1.9106 2.9528 2.1408 1.7114 1.7764 1.3788 1.4266 1.2890 1.5220 1.3159 1.2972 1.4425 1.5469 1.4297 1.4559 1.5739 1.4867 1.4614 1.2909 1.2504 1.1940 1.0559 1.0911 1.0912 1.0604 1.0885 1.0722 1.0786 1.0960 1.0708 1.0774 1.0679 1.0727 1.0650 1.0680 1.0647 1.0655 1.0645 1.0359 1.0362 1.0961 1.0972 1.0993 1.0930 1.0991 1.1000 1.0983 1.0977 1.1002 1.0992 1.0736 1.0658
irintensity: 0.7660 0.2049 0.7295 0.5537 1.7538 3.7268 1.7065 1.6381 3.0539 125.5477 13.8217 2.6253 1.6310 1.0668 2.1930 3.9568 7.2233 2.0442 4.1392 8.6961 4.5723 87.0633 2.4024 2.1044 3.4347 3.7088 24.6801 2.7795 17.4362 2.6911 0.7406 1.2031 7.3280 2.7268 8.2293 1.5570 19.3420 13.7063 2.4646 128.9827 3.4076 41.6414 18.7893 14.4438 7.0938 3.6219 3.3112 8.1110 2.0575 12.7523 0.7797 3.2839 14.2947 9.9608 2.0618 0.6032 6.6593 1.3969 20.1557 43.3467 18.8238 26.4598 1.2115 3.2433 3.7461 5.0933 7.3502 8.4936 29.3783 3.4363 9.1604 10.6197 53.1883 9.9074 18.4897 6.7064 45.9906 31.0202 74.3458 31.8145 30.8074 90.0339 76.5041 9.6800 8.2401 54.0531 105.8869 20.1067 61.2387 24.0344 24.2415 1.0327 3.5017
temp: 298.150 k
press: 1.00000 atm
elementType: 8 7 6 6 6 6 6 6 6 6 6 6 1 1 1 1 1 1 1 1 1 1 1 1 1 1 1 1 1 1 1 1 1
symmnumber: 1
zpe: 780918.7 jmol-1
zpe.correction: 0.297436 hartree
zpe.thermalcorrener: 0.311383 hartree
zpe.thermalcorrenthalpy: 0.312327 hartree
zpe.thermalcorrgfe: 0.256912 hartree
zpe.sumelectzpe: -522.625873 hartree
zpe.sumelectthermal: -522.611927 hartree
zpe.sumelectthermalent: -522.610982 hartree
zpe.sumelectthermalfe: -522.666397 hartree
dipole: 0.2914 -0.9831 0.7141
dipole: 1.2495
quadrupole: -70.1103 -81.2836 -74.6919
quadrupole: 4.8489 -0.8506 0.3689
quadrupole: 5.2516 -5.9217 0.6701 4.8489 -0.8506 0.3689
hfenergy: -522.9233092 hartree
pointgroup: C01 [X(C10H21N1O1)]
dipole: 0.0824694 0.0616951 0.4806934 debye
polarizability: 141.8846357|-2.9664401|102.6160598|2.2703966|-3.2207332|107.5934989 unknown
InChI: InChI=1S/C10H21NO/c1-10(2,12)8-11-9-6-4-3-5-7-9/h9,11-12H,3-8H2,1-2H3
charge 0 multiplicity 1
33 atoms
O  -3.618387 0.481417 -1.585813
N  -0.452165 0.270435 0.367075
C  0.926706 -0.180852 0.049545
C  1.731638 0.793082 -0.860944
C  1.694755 -0.44019 1.366161
C  3.166361 0.276266 -1.129572
C  3.133363 -0.948629 1.107431
C  3.923939 0.019332 0.194505
C  -1.392061 0.390316 -0.767669
C  -2.86848 0.228355 -0.322145
C  -3.145454 -1.19906 0.186385
C  -3.262256 1.288668 0.728755
H  0.831416 -1.148906 -0.487957
H  1.784659 1.782102 -0.355871
H  1.19271 0.94704 -1.816124
H  1.123732 -1.163809 1.977471
H  1.742432 0.507726 1.945951
H  3.721383 0.99999 -1.757818
H  3.111336 -0.670059 -1.707739
H  3.085338 -1.946345 0.6233
H  3.662801 -1.088086 2.070018
H  4.933043 -0.387306 -0.012229
H  4.067597 0.984289 0.724174
H  -0.429049 1.127526 0.937904
H  -1.167958 -0.414822 -1.492292
H  -1.319245 1.352852 -1.323595
H  -4.17731 -1.296641 0.576428
H  -2.436173 -1.44703 0.995483
H  -3.010878 -1.925758 -0.634925
H  -3.069138 2.305312 0.340751
H  -4.338682 1.215286 0.976552
H  -2.695508 1.143574 1.666496
H  -4.582365 0.331529 -1.409594
