program: Gaussian 09
title: 000276967
version: EM64L-G09RevD.01
frameworkgroup: C1[X(C10H19NO)]
method: RPBEPBE
basis: SDD
operation: Freq
keyword: #p
keyword: freq=noraman
keyword: PBEPBE/SDD
title: #p freq=noraman PBEPBE/SDD
converged: YES YES NO NO
title: Mulliken charges:
elementType: O N C C C C C C C C C C H H H H H H H H H H H H H H H H H H H
charge: -0.283238 -0.367715 0.307154 0.267121 -0.434483 -0.492095 -0.396430 -0.381195 -0.391420 -0.390851 -0.709027 -0.772493 0.215836 0.200943 0.202915 0.209220 0.271841 0.219490 0.195495 0.189463 0.216512 0.223487 0.190681 0.200271 0.187725 0.199347 0.221419 0.226067 0.221777 0.232660 0.219523
chargesum: 0.00000
title: Mulliken charges with hydrogens summed into heavy atoms:
elementType: O N C C C C C C C C C C
charge: -0.283238 -0.095874 0.307154 0.267121 -0.017703 -0.079960 0.018554 0.024780 0.022748 -0.002855 -0.062195 -0.098533
polarizability: 1.34824707e+02 7.37239371e-01 1.06591945e+02 1.63854137e+00 1.76816070e+00 9.78691548e+01
1716.lowfreq: -8.5207 -0.0011 -0.0009 -0.0004 5.2192 24.9025 61.7717 100.4946 124.5756
frequency: 61.3946 100.4863 124.5023 198.2755 215.9543 228.9218 263.1816 267.7214 302.8092 332.0421 359.9202 374.0259 400.2300 445.4774 463.0300 464.7281 513.9363 596.8823 619.8854 690.4824 725.1330 770.6332 795.4230 807.4442 848.2902 882.3919 885.7171 915.8768 924.8202 934.7690 949.4839 957.0431 978.8281 989.5412 1016.2331 1051.8755 1073.7722 1096.0901 1117.7809 1144.4480 1146.4728 1168.6114 1177.4951 1211.4544 1217.3577 1245.2099 1255.7796 1276.3638 1289.7214 1322.5828 1324.8844 1336.0866 1342.3830 1344.2622 1365.2209 1375.3974 1391.4198 1439.3153 1447.8301 1455.0490 1458.4635 1459.6757 1465.5326 1466.2921 1472.8801 1476.3302 1480.3609 1488.0825 2959.3362 2962.1751 2971.5949 2974.1317 2979.0605 2981.6544 2988.1983 2990.6778 3028.6890 3032.0548 3039.1495 3048.8177 3056.3013 3063.2574 3070.5749 3073.0028 3078.9657 3093.1601 3406.4130
redmass: 3.0660 2.9764 2.5621 2.4448 1.2010 2.0156 2.1473 1.3082 1.9049 2.1854 2.4715 1.9436 2.3528 2.2084 2.6934 2.3370 2.1300 3.8061 3.4036 2.8412 3.7803 1.5678 3.0279 2.3885 1.9869 1.8599 2.3414 1.7426 1.4641 1.8582 1.4162 2.0764 3.0784 2.9253 1.4161 1.8279 1.2415 1.4400 2.8693 1.7039 2.2977 1.6867 1.7770 1.7509 2.4106 1.4423 1.3663 1.3636 1.8374 1.4663 1.4800 1.4116 1.4442 1.5404 1.5689 1.2249 1.2169 1.2609 1.0927 1.0884 1.0938 1.0833 1.0516 1.0823 1.0939 1.0624 1.0618 1.0705 1.0660 1.0628 1.0355 1.0586 1.0375 1.0602 1.0617 1.0633 1.0963 1.1006 1.1010 1.1031 1.1028 1.0991 1.0988 1.0988 1.0987 1.0993 1.0747
irintensity: 0.2945 0.9462 1.2533 3.5615 0.3395 0.4863 0.3055 1.1584 1.3284 1.1142 1.6826 1.0500 2.0631 5.2401 15.8892 5.1075 2.9062 8.1911 6.4343 42.4954 49.9251 5.1949 6.2694 0.5282 6.3823 17.8227 16.0973 3.4139 7.7201 1.2568 5.7380 5.5603 18.2244 30.5503 1.2121 0.7676 2.1633 2.1325 72.4255 6.0960 10.7551 23.8056 1.6279 9.9605 18.1751 10.5667 5.5961 12.6322 4.2372 7.9442 5.9642 0.7817 0.4647 1.9747 16.6491 28.2981 19.5665 15.2786 4.6911 6.3409 10.5922 2.0271 2.9622 17.6187 8.2355 13.4406 2.5031 4.8076 57.7130 39.8739 21.7066 29.1859 33.5430 35.5580 63.1760 15.0798 68.8186 50.1826 14.3919 2.3528 111.0964 10.1471 18.1010 32.7862 55.9651 40.7987 1.0509
temp: 298.150 k
press: 1.00000 atm
elementType: 8 7 6 6 6 6 6 6 6 6 6 6 1 1 1 1 1 1 1 1 1 1 1 1 1 1 1 1 1 1 1
symmnumber: 1
zpe: 727253.0 jmol-1
zpe.correction: 0.276996 hartree
zpe.thermalcorrener: 0.289095 hartree
zpe.thermalcorrenthalpy: 0.290040 hartree
zpe.thermalcorrgfe: 0.240044 hartree
zpe.sumelectzpe: -521.454111 hartree
zpe.sumelectthermal: -521.442011 hartree
zpe.sumelectthermalent: -521.441067 hartree
zpe.sumelectthermalfe: -521.491062 hartree
dipole: 0.9449 -0.2819 -0.3933
dipole: 1.0616
quadrupole: -70.3568 -73.2455 -78.1751
quadrupole: -0.7768 2.9361 2.7372
quadrupole: 3.5690 0.6803 -4.2493 -0.7768 2.9361 2.7372
hfenergy: -521.7311066 hartree
pointgroup: C01 [X(C10H19N1O1)]
dipole: 0.3696379 -0.1243808 -0.1494376 debye
polarizability: 134.8144595|-0.0462357|106.6355277|1.984575|1.5527549|97.8358201 unknown
InChI: InChI=1S/C10H19NO/c1-9(2)8-12-10(11-9)6-4-3-5-7-10/h11H,3-8H2,1-2H3
charge 0 multiplicity 1
31 atoms
O  0.042555 -0.3986 1.214576
N  0.980052 -0.494686 -0.959019
C  -0.303319 -0.273173 -0.258942
C  2.115149 -0.103625 -0.041959
C  -0.881914 1.137784 -0.525333
C  -1.333259 -1.371115 -0.575456
C  1.387547 0.182757 1.328172
C  -2.221459 1.361648 0.213703
C  -2.673911 -1.142073 0.159324
C  -3.249355 0.262269 -0.142667
C  2.849077 1.153271 -0.559398
C  3.10056 -1.289853 0.085216
H  -1.024195 1.235976 -1.619419
H  -0.144679 1.908127 -0.230746
H  -0.902362 -2.350364 -0.288672
H  -1.500314 -1.379685 -1.671462
H  1.067326 -1.486958 -1.226865
H  1.87909 -0.308882 2.184506
H  1.328196 1.27477 1.518051
H  -2.622896 2.362717 -0.036747
H  -2.035347 1.343539 1.30538
H  -2.501965 -1.240293 1.248261
H  -3.39603 -1.928484 -0.133413
H  -4.187882 0.418153 0.423481
H  -3.506541 0.332981 -1.220578
H  3.60036 1.504613 0.174217
H  3.36541 0.93457 -1.510891
H  2.133936 1.972558 -0.747854
H  3.980513 -1.010332 0.692101
H  2.61056 -2.156074 0.567774
H  3.4673 -1.601435 -0.911345
