program: Gaussian 09
title: 000276950
version: EM64L-G09RevD.01
frameworkgroup: C1[X(C9H21NO)]
method: RPBEPBE
basis: SDD
operation: Freq
keyword: #p
keyword: freq=noraman
keyword: PBEPBE/SDD
title: #p freq=noraman PBEPBE/SDD
converged: YES YES NO NO
title: Mulliken charges:
elementType: O N C C C C C C C C C H H H H H H H H H H H H H H H H H H H H H
charge: -0.443072 -0.290195 -0.367459 -0.367696 -0.392662 -0.352102 -0.374081 -0.356075 -0.359721 -0.695811 -0.331261 0.188235 0.188732 0.190900 0.187580 0.217547 0.180689 0.187718 0.187057 0.180692 0.208793 0.195424 0.194756 0.240995 0.194548 0.203692 0.209754 0.209612 0.215518 0.206901 0.207421 0.333574
chargesum: 0.00000
title: Mulliken charges with hydrogens summed into heavy atoms:
elementType: O N C C C C C C C C C
charge: -0.109498 -0.049201 0.009507 0.010785 0.005574 0.022672 0.015405 0.034104 0.038518 -0.060927 0.083060
polarizability: 1.45996914e+02 1.19276354e+00 9.67312432e+01 -2.28834343e-01 -2.05314573e+00 9.02560913e+01
1716.lowfreq: -6.0305 0.0003 0.0006 0.0009 5.8876 25.8956 37.4347 39.8715 56.3288
frequency: 25.6950 39.8641 55.0086 62.4833 97.0343 104.7656 113.3005 133.6516 148.5397 163.9267 197.3259 208.3304 225.6199 300.3613 322.4521 377.6181 409.6445 481.4719 513.6663 684.5410 724.3213 735.6723 769.9627 811.9304 834.5858 887.6381 917.3943 951.3064 993.1923 998.6528 1010.4149 1032.0104 1050.6507 1062.5806 1071.2238 1080.3790 1085.5389 1113.2189 1126.6370 1147.0910 1185.3834 1206.7757 1227.5736 1240.1954 1267.5110 1270.6850 1274.9363 1279.8111 1290.9824 1292.7438 1296.2307 1317.1405 1338.9376 1352.5733 1356.0472 1371.5641 1387.6137 1394.3524 1456.3857 1463.4806 1464.4902 1468.4678 1472.8851 1475.1851 1476.0261 1482.3347 1488.1993 1490.4311 1497.9517 2848.2691 2882.0377 2951.8783 2952.7527 2956.1268 2962.7715 2969.5082 2971.7905 2979.3397 2985.4841 2986.7912 2992.9225 2997.6065 3014.5765 3032.0943 3045.7412 3065.9280 3068.3304 3071.0585 3421.6825 3562.9856
redmass: 4.3986 4.2977 1.6067 3.4370 1.7245 3.5938 2.6066 1.8162 2.3016 2.3086 4.2004 3.5824 1.1285 1.6487 1.7076 4.0890 3.1939 3.1325 3.5685 1.2822 1.0633 1.0863 1.1284 1.1053 1.1877 1.8894 1.2074 4.4616 2.9163 1.6091 2.4107 2.7497 2.9341 1.6604 2.3692 2.1041 2.4139 1.2985 2.2572 4.0874 1.7999 1.4941 1.3430 1.3650 1.2074 1.2260 1.2051 1.0470 1.1713 1.1579 1.1169 1.3241 1.3390 1.5210 1.6539 1.3088 1.2171 1.4360 1.1986 1.0723 1.0688 1.0711 1.0725 1.0732 1.0434 1.0823 1.0931 1.0963 1.0852 1.0711 1.0685 1.0589 1.0594 1.0626 1.0612 1.0588 1.0367 1.0745 1.0780 1.0966 1.0840 1.0993 1.1020 1.1032 1.1029 1.1026 1.1007 1.0993 1.0738 1.0662
irintensity: 0.3616 0.1808 1.1971 1.0149 2.5545 0.7137 3.4184 2.1787 3.8250 4.5231 0.1991 0.2457 0.0043 46.5221 121.1161 0.3952 14.9938 4.7993 3.5365 92.9866 14.1729 0.7558 2.9601 7.1057 0.1742 4.5129 0.7434 71.1094 16.3941 3.8002 6.6862 15.6761 2.3738 0.5500 10.6916 0.8170 2.9859 56.6965 2.4130 50.6470 3.0273 7.7179 1.9583 0.4800 0.5228 1.3215 0.9150 0.2861 0.3560 0.4714 0.3462 5.0343 13.4631 6.1440 0.7452 5.2435 11.3421 4.4196 32.5231 0.4217 0.0253 1.8651 0.8329 2.1364 12.1399 3.7737 10.3748 10.9819 7.6751 90.5572 103.6088 0.9320 0.8641 1.4827 33.1817 143.0380 34.4337 53.1834 41.4946 0.6995 48.8021 0.3218 0.3760 12.2769 150.7348 47.3424 103.0337 54.7433 1.8477 7.1686
temp: 298.150 k
press: 1.00000 atm
elementType: 8 7 6 6 6 6 6 6 6 6 6 1 1 1 1 1 1 1 1 1 1 1 1 1 1 1 1 1 1 1 1 1
symmnumber: 1
zpe: 761879.3 jmol-1
zpe.correction: 0.290185 hartree
zpe.thermalcorrener: 0.305362 hartree
zpe.thermalcorrenthalpy: 0.306306 hartree
zpe.thermalcorrgfe: 0.246130 hartree
zpe.sumelectzpe: -484.557849 hartree
zpe.sumelectthermal: -484.542672 hartree
zpe.sumelectthermalent: -484.541728 hartree
zpe.sumelectthermalfe: -484.601904 hartree
dipole: 1.7670 -0.6960 0.4477
dipole: 1.9511
quadrupole: -89.2009 -70.5116 -69.4263
quadrupole: 4.3147 -6.8164 -3.3162
quadrupole: -12.8213 5.8680 6.9533 4.3147 -6.8164 -3.3162
hfenergy: -484.8480337 hartree
pointgroup: C01 [X(C9H21N1O1)]
dipole: 0.6886164 0.2721071 -0.2025781 debye
polarizability: 146.0237603|-0.3631654|96.3774339|-0.2219271|-2.4874572|90.5830542 unknown
InChI: InChI=1S/C9H21NO/c1-2-3-4-5-6-7-10-8-9-11/h10-11H,2-9H2,1H3
charge 0 multiplicity 1
32 atoms
O  -6.34248 0.03519 0.106128
N  -2.581653 -0.416203 0.122139
C  1.204398 0.406676 0.017072
C  2.487774 -0.454357 0.017521
C  -0.090417 -0.434925 0.063553
C  3.785767 0.383225 -0.025817
C  -1.367189 0.427401 0.060063
C  5.069844 -0.477711 -0.023239
C  -3.85932 0.325225 0.110997
C  6.36174 0.367144 -0.065419
C  -5.044902 -0.655838 0.033921
H  1.228315 1.098244 0.885243
H  1.194731 1.046623 -0.890078
H  2.466829 -1.143607 -0.852348
H  2.497289 -1.097291 0.922732
H  -0.127835 -1.126025 -0.800784
H  -0.078545 -1.069616 0.975832
H  3.778909 1.025787 -0.931283
H  3.807227 1.073257 0.843813
H  -1.31276 1.168004 0.899417
H  -1.409629 1.017097 -0.877942
H  5.047867 -1.16629 -0.892579
H  5.075223 -1.119927 0.881229
H  -2.535087 -1.070877 0.916698
H  -3.864826 0.978383 -0.786644
H  -4.005384 0.992264 0.996087
H  6.39381 0.995794 -0.975448
H  6.421998 1.041987 0.809403
H  7.264726 -0.270816 -0.063198
H  -5.048748 -1.329418 0.909264
H  -4.956764 -1.274486 -0.882343
H  -6.44431 0.610183 -0.693888
