program: Gaussian 09
title: 000276937
version: EM64L-G09RevD.01
frameworkgroup: C1[X(C8H17NO)]
method: RPBEPBE
basis: SDD
operation: Freq
keyword: #p
keyword: freq=noraman
keyword: PBEPBE/SDD
title: #p freq=noraman PBEPBE/SDD
converged: NO YES NO NO
title: Mulliken charges:
elementType: O N C C C C C C C C H H H H H H H H H H H H H H H H H
charge: -0.266494 -0.368111 0.277213 0.289080 -0.398964 -0.355582 -0.772754 -0.709239 -0.770507 -0.708152 0.276026 0.196776 0.218140 0.214366 0.201297 0.222594 0.219983 0.231848 0.225447 0.221236 0.200812 0.227100 0.226098 0.235068 0.212474 0.245371 0.208874
chargesum: 0.00000
title: Mulliken charges with hydrogens summed into heavy atoms:
elementType: O N C C C C C C C C
charge: -0.266494 -0.092085 0.277213 0.289080 0.015953 0.060081 -0.098329 -0.061743 -0.082241 -0.041434
polarizability: 1.08563505e+02 -1.17608127e+00 9.06203806e+01 -1.85977584e+00 2.05225277e+00 8.58207979e+01
1716.lowfreq: -31.6678 -0.0011 -0.0010 -0.0002 10.6802 16.5092 61.2428 100.5881 130.8815
frequency: 60.3710 100.4786 130.8187 153.0697 201.9864 223.2947 239.3314 265.6614 281.6842 308.0873 323.7703 356.5988 396.9252 411.7539 449.7717 485.3269 570.8642 626.4253 683.0898 715.4476 790.4465 800.5770 810.9604 893.8357 916.6403 933.9506 947.9980 970.5233 987.7585 1006.3237 1017.2649 1031.1429 1059.5761 1107.9764 1154.4151 1165.2500 1200.7757 1217.9329 1222.3326 1272.0686 1297.7492 1328.1566 1332.1354 1375.6034 1381.7210 1385.3586 1391.7495 1439.4297 1457.3108 1459.3582 1463.1502 1467.0351 1474.8974 1476.5285 1477.5029 1481.9109 1486.0457 1492.3900 2958.7585 2971.0687 2978.3303 2980.0471 2993.5079 2996.0922 3044.4878 3060.2516 3068.9469 3071.8617 3072.9690 3079.0563 3086.8737 3091.0481 3092.9799 3103.6322 3420.7630
redmass: 2.8693 2.0583 2.4361 1.0603 1.7986 1.0798 1.5552 1.6181 1.4006 2.0966 2.1669 2.3069 2.9593 2.4111 2.8047 2.0395 3.4309 3.4325 2.8687 3.3162 1.2465 3.4430 2.4213 2.0990 1.7323 1.5606 1.3923 2.9843 2.6946 1.4904 1.5014 1.7426 2.0722 2.0544 1.4927 2.0740 2.1648 2.1045 1.9397 2.3635 1.8423 1.3469 1.4846 1.2188 1.2346 1.2505 1.2158 1.2515 1.0996 1.0619 1.0547 1.0537 1.0657 1.0623 1.0453 1.0629 1.0602 1.0654 1.0663 1.0354 1.0372 1.0354 1.0471 1.0486 1.1002 1.0987 1.0992 1.0992 1.0992 1.0988 1.1005 1.0995 1.0997 1.0994 1.0752
irintensity: 0.1117 0.3244 2.5981 0.5019 0.4096 0.5927 1.9412 1.4908 0.6506 0.0124 1.1445 1.1319 7.3326 1.3117 5.4033 22.0866 0.7021 19.7455 53.0557 28.5808 9.3525 4.7060 3.0457 12.2783 4.0439 7.1244 4.6395 44.1419 22.3542 5.5156 4.2717 14.0820 10.2487 23.6679 14.0161 31.4850 32.5824 15.7544 2.2963 40.1639 9.2819 1.6257 9.0020 20.0001 24.4685 35.2354 23.7367 16.7265 1.5340 5.0462 4.5422 7.9942 7.2429 9.5692 5.9896 10.7616 3.4071 12.3301 57.4484 25.3001 33.9537 37.5924 36.1136 5.7413 16.6505 15.6286 20.1979 22.6473 62.7371 54.7566 39.5206 36.6250 27.2305 21.1414 0.9150
temp: 298.150 k
press: 1.00000 atm
elementType: 8 7 6 6 6 6 6 6 6 6 1 1 1 1 1 1 1 1 1 1 1 1 1 1 1 1 1
symmnumber: 1
zpe: 629422.4 jmol-1
zpe.correction: 0.239734 hartree
zpe.thermalcorrener: 0.251629 hartree
zpe.thermalcorrenthalpy: 0.252574 hartree
zpe.thermalcorrgfe: 0.203231 hartree
zpe.sumelectzpe: -444.178916 hartree
zpe.sumelectthermal: -444.167021 hartree
zpe.sumelectthermalent: -444.166077 hartree
zpe.sumelectthermalfe: -444.215420 hartree
dipole: -0.9830 0.3547 -0.8742
dipole: 1.3625
quadrupole: -59.0697 -66.2868 -64.2671
quadrupole: -0.0528 -0.7444 4.8284
quadrupole: 4.1382 -3.0790 -1.0592 -0.0528 -0.7444 4.8284
hfenergy: -444.4186501 hartree
pointgroup: C01 [X(C8H17N1O1)]
dipole: -0.3732205 0.2791651 -0.264814 debye
polarizability: 108.4038772|-1.5699783|88.68335|-2.1644205|3.2779052|87.9174564 unknown
InChI: InChI=1S/C8H17NO/c1-5-8(4)9-7(2,3)6-10-8/h9H,5-6H2,1-4H3
charge 0 multiplicity 1
27 atoms
O  0.038783 -1.60543 0.452037
N  -0.146719 0.300948 -0.942012
C  -1.408772 0.282515 -0.113966
C  0.860609 -0.57698 -0.305694
C  -1.13854 -0.868174 0.933685
C  1.740504 0.181729 0.721213
C  -2.611603 -0.061024 -1.024484
C  -1.640046 1.638392 0.590492
C  1.681689 -1.35586 -1.337817
C  2.601771 1.300664 0.100105
H  -0.342832 -0.01862 -1.901622
H  -0.951355 -0.444042 1.942068
H  -1.970075 -1.59071 0.992282
H  2.377049 -0.56439 1.233743
H  1.081784 0.618915 1.495517
H  -3.560085 -0.013211 -0.459772
H  -2.685466 0.65659 -1.863801
H  -2.510232 -1.08107 -1.440209
H  -0.74845 1.936888 1.168811
H  -1.838997 2.430313 -0.153293
H  -2.50271 1.582796 1.282286
H  1.015504 -1.994616 -1.944425
H  2.233014 -0.671165 -2.004827
H  2.40878 -2.008984 -0.826951
H  3.378454 0.897019 -0.575317
H  1.962259 1.988313 -0.481354
H  3.11668 1.882091 0.886806
