program: Gaussian 09
title: 000276896
version: EM64L-G09RevD.01
frameworkgroup: C1[X(C11H8N2O3)]
method: RPBEPBE
basis: SDD
operation: Freq
keyword: #p
keyword: freq=noraman
keyword: PBEPBE/SDD
title: #p freq=noraman PBEPBE/SDD
converged: YES YES NO NO
title: Mulliken charges:
elementType: O O O N N C C C C C C C C C C C H H H H H H H H
charge: -0.261571 -0.250162 -0.274945 -0.635846 -0.035679 0.195340 0.176162 0.520694 -0.521497 -0.352634 -0.308239 -0.202033 -0.323512 0.161721 0.173003 -0.310644 0.266057 0.261882 0.259956 0.246281 0.245721 0.277096 0.351894 0.340957
chargesum: 0.00000
title: Mulliken charges with hydrogens summed into heavy atoms:
elementType: O O O N N C C C C C C C C C C C
charge: -0.261571 -0.250162 -0.274945 0.057005 -0.035679 0.195340 0.176162 0.520694 -0.255441 -0.090752 -0.048283 0.289969 -0.046416 0.161721 0.173003 -0.310644
polarizability: 2.88630349e+02 -9.77056906e+00 1.46872712e+02 4.69068726e-02 -4.96422096e-03 5.94109502e+01
1716.lowfreq: -0.0008 -0.0004 0.0003 1.2924 2.0970 6.9269 29.8851 39.8380 59.4430
frequency: 29.8530 39.8342 59.4394 80.1321 91.1510 145.4676 183.9922 211.5479 225.7208 264.5870 289.2458 375.1878 392.5049 422.6859 436.8382 495.2151 520.7633 544.5643 564.4440 583.8851 609.2753 631.8439 645.7557 681.3184 727.1064 740.8427 756.5484 766.4266 804.8779 824.0795 836.2454 877.6476 921.2851 953.6725 975.6683 999.9876 1052.5624 1058.3935 1063.2152 1076.8814 1119.7909 1155.0232 1197.7908 1258.3782 1290.4724 1338.9110 1351.6326 1365.0730 1398.0674 1456.5641 1474.1025 1486.8183 1571.1081 1596.8450 1603.7487 1625.0483 1649.6780 2133.4818 3022.8252 3089.6400 3104.6705 3169.3412 3176.4381 3193.6022 3515.8696 3669.6537
redmass: 2.5883 5.1449 5.6237 7.4834 7.2861 10.1388 7.0443 8.6614 6.4640 6.2436 6.9492 4.3664 5.3647 2.9727 5.0156 8.3235 1.8383 7.9805 1.3772 5.2790 2.0280 2.8083 5.1533 9.5125 4.0080 7.4021 6.5799 7.0801 6.2994 1.3836 10.4513 1.4559 4.1430 1.3487 5.4325 1.4122 1.9810 3.6152 1.4562 3.5439 1.0370 1.3396 1.6465 4.4050 1.5469 4.1232 2.8100 1.2936 2.3257 4.1922 2.0376 1.4474 3.4399 7.7358 2.1091 4.9910 3.8049 12.5949 1.0535 1.0876 1.1192 1.0934 1.0890 1.0968 1.0455 1.1042
irintensity: 9.6046 4.7508 1.1573 18.0603 0.7735 8.9031 0.0659 1.2781 0.2652 3.3026 0.1242 0.2726 20.1232 5.0682 0.3208 17.6031 0.8412 16.5943 159.6039 19.3502 135.6181 14.8335 2.4724 0.3719 8.7321 21.2126 4.0337 10.0067 12.3278 35.3884 32.9695 25.8916 5.6026 0.8411 166.7267 16.4380 17.6139 23.1216 4.6349 11.1312 0.0143 30.3277 0.4369 578.6948 71.3175 181.8206 74.6265 2.1933 29.4596 26.1407 234.7461 92.5393 393.3434 5.3723 4.7728 42.0077 289.5968 64.9186 128.3903 1.0935 25.8317 0.9824 0.6061 3.1921 69.3389 51.8771
temp: 298.150 k
press: 1.00000 atm
elementType: 8 8 8 7 7 6 6 6 6 6 6 6 6 6 6 6 1 1 1 1 1 1 1 1
symmnumber: 1
zpe: 448451.7 jmol-1
zpe.correction: 0.170806 hartree
zpe.thermalcorrener: 0.184759 hartree
zpe.thermalcorrenthalpy: 0.185703 hartree
zpe.thermalcorrgfe: 0.128214 hartree
zpe.sumelectzpe: -757.991748 hartree
zpe.sumelectthermal: -757.977795 hartree
zpe.sumelectthermalent: -757.976851 hartree
zpe.sumelectthermalfe: -758.034340 hartree
dipole: 2.8740 0.1496 0.0224
dipole: 2.8779
quadrupole: -64.9081 -106.0424 -93.7474
quadrupole: -4.7175 0.1610 -0.0286
quadrupole: 23.3245 -17.8098 -5.5148 -4.7175 0.1610 -0.0286
hfenergy: -758.1625545 hartree
pointgroup: C01 [X(C11H8N2O3)]
dipole: 1.1322014 -0.0012395 -0.0124485 debye
dipolederiv: -1.3156337 -0.1006135 0.288126 -0.1784374 -0.2844777 0.0905499 0.4949562 0.0905837 -0.5053433 -1.9480793 -0.0808947 0.2238342 -0.0773531 -0.265958 0.0633134 0.1890761 0.0618532 -0.4246185 -0.7880397 0.0532063 -0.1548906 0.1120791 -0.4400781 0.2168489 -0.3214426 0.2163259 -0.9829255 -1.344399 -0.1157302 0.3233348 -0.1150127 -0.6606056 -0.0787901 0.3210974 -0.0789703 -0.4604257 -0.301928 -0.0241783 0.0679227 -0.0912201 -0.2787356 0.0711312 0.2576248 0.0725175 -0.4543432 0.5205112 0.1483107 -0.4140367 0.4388686 0.0856288 -0.0847088 -1.2381654 -0.0864237 0.2929418 1.6818032 0.054671 -0.1405175 -0.1087692 0.0537129 0.0209309 0.3409655 0.0222515 -0.0040328 -0.8442018 0.0386727 -0.1173206 0.1222763 -0.0117637 -0.0026534 -0.3552512 -0.0044741 -0.0059028 0.238246 -0.0610281 0.1754044 0.0543343 -0.1363573 -0.0668466 -0.1515852 -0.0675872 0.031242 -0.5199801 -0.017089 0.0431378 -0.107816 -0.1308006 -0.075938 0.3072315 -0.0748825 0.0602609 0.2389864 -0.019348 0.0599007 -0.1029165 -0.1046143 -0.0214423 0.2929671 -0.0199276 -0.0506805 1.2638115 0.0562611 -0.1777816 0.1282149 0.5677377 -0.005536 -0.3889631 -0.0070389 0.5887511 1.5791724 0.0390962 -0.0936594 0.0337432 -0.0103304 -0.0204196 -0.076852 -0.0205606 0.0390159 -1.3840689 0.0159405 -0.059701 -0.0925023 -0.0268724 0.0997296 0.2462154 0.1008046 -0.2748673 2.2549079 -0.0140772 0.0573913 -0.1458036 0.3587725 -0.3121521 0.4310291 -0.3107304 1.138786 -0.1049858 0.0448878 -0.1283397 0.1607048 0.0879948 -0.1430263 -0.454759 -0.1448474 0.441164 0.0973263 0.0190612 -0.0548836 0.0061028 0.1560234 0.0535548 -0.0170685 0.0538595 0.0212757 0.0631487 0.0115221 -0.0339013 0.0182611 0.1582608 0.0577609 -0.0522369 0.0576003 0.0136669 0.0745688 -0.0201951 0.0572759 -0.0154773 0.1394225 0.0372244 0.0438598 0.0371365 0.0470895 -0.0951172 -0.068045 0.0192437 -0.1774864 -0.060401 0.0008488 0.0215712 -0.0257791 0.0623835 -0.093076 0.0410701 0.0563231 0.131999 -0.0311693 -0.0735304 0.130474 -0.0449893 0.0241089 0.1622502 -0.0115754 0.0332888 -0.0024788 0.1126195 0.0299859 0.0058574 0.0299763 0.0384308 0.3078466 0.0050391 -0.0148847 0.0151239 0.3601596 0.0726669 -0.0435204 0.0727061 0.1781063 0.2569301 0.0050356 -0.0152668 -0.0064346 0.3618316 0.070498 0.0169186 0.0705961 0.1859163 unknown
polarizability: 286.8747451|6.7471686|69.2517586|-17.201704|-27.9456781|138.7875078 unknown
InChI: InChI=1S/C11H8N2O3/c12-5-8(11(13)14)3-7-1-2-9-10(4-7)16-6-15-9/h1-4H,6,13H2
charge 0 multiplicity 1
24 atoms
O  3.535643 0.618923 -1.609211
O  4.229531 -0.141836 0.561921
O  -3.782345 0.654431 -1.790612
N  -4.941102 -0.016158 0.108036
N  -2.723277 -0.896585 2.624516
C  2.410876 0.32865 -0.799874
C  2.826016 -0.118014 0.475954
C  0.092021 0.089433 -0.139118
C  1.068143 0.442788 -1.136651
C  1.904243 -0.469194 1.469659
C  0.532643 -0.359755 1.145658
C  4.724961 0.314746 -0.771646
C  -1.305893 0.22075 -0.528985
C  -2.481275 -0.025896 0.15555
C  -3.778781 0.234083 -0.594101
C  -2.571079 -0.501145 1.500981
H  0.757945 0.789392 -2.126519
H  2.233292 -0.81307 2.452896
H  -0.200531 -0.629733 1.908739
H  5.31735 1.234435 -0.633568
H  5.297165 -0.505731 -1.23648
H  -1.49153 0.581461 -1.553049
H  -4.937464 -0.353975 1.070353
H  -5.829353 0.147201 -0.363652
