program: Gaussian 09
title: 000276935
version: EM64L-G09RevD.01
frameworkgroup: C1[X(C8H17NO)]
method: RPBEPBE
basis: SDD
operation: Freq
keyword: #p
keyword: freq=noraman
keyword: PBEPBE/SDD
title: #p freq=noraman PBEPBE/SDD
converged: YES YES NO NO
title: Mulliken charges:
elementType: O N C C C C C C C C H H H H H H H H H H H H H H H H H
charge: -0.438285 -0.344840 -0.022367 -0.488416 -0.439160 -0.409286 -0.443258 -0.085584 -0.367266 -0.681897 0.190969 0.218838 0.204796 0.214170 0.207175 0.211098 0.211402 0.211675 0.209112 0.241191 0.198419 0.218867 0.200693 0.214280 0.199434 0.236761 0.331478
chargesum: 0.00000
title: Mulliken charges with hydrogens summed into heavy atoms:
elementType: O N C C C C C C C C
charge: -0.106806 -0.103648 0.168602 -0.064783 -0.017815 0.013214 -0.022470 0.112835 0.052295 -0.031422
polarizability: 1.14494234e+02 -6.56065426e-02 8.85498669e+01 -1.39992201e+00 2.62829618e+00 8.30603652e+01
1716.lowfreq: -29.6044 -19.3613 -0.0003 0.0002 0.0008 6.6719 14.1394 32.7948 62.7205
frequency: -27.4847 31.1478 62.6816 94.3541 141.1729 173.7807 210.4427 239.9142 293.1537 312.3099 363.7440 402.3404 454.2287 516.1914 562.2461 608.6966 681.3648 763.3562 803.5388 842.1691 864.2352 892.1271 897.2462 934.0720 942.6126 966.9794 974.0278 979.6248 1055.5441 1065.0918 1079.3027 1114.5631 1135.7899 1155.8784 1167.6754 1173.0708 1197.9967 1208.9902 1236.9028 1267.3052 1274.5873 1286.3051 1294.5847 1305.9737 1309.2676 1323.4737 1344.0003 1351.2705 1369.3316 1379.7035 1456.1503 1460.8326 1464.6132 1469.9380 1470.8478 1473.1104 1478.5936 1490.2009 2852.2963 2970.8587 2979.7117 2984.6843 2985.7622 2991.3171 2994.3712 3012.1014 3039.5172 3054.3675 3059.5467 3062.0485 3069.0737 3079.1688 3082.8983 3415.0126 3561.1034
redmass: 1.7282 2.6018 3.7275 2.9883 2.3252 2.4259 1.1325 2.8413 1.7410 2.0902 2.3935 2.1996 1.7939 2.6464 2.6632 2.6300 1.8751 1.2021 1.7049 2.4041 2.8452 2.0974 1.5188 1.8651 1.4768 2.3369 2.3336 1.3783 2.3267 1.6916 2.2468 2.2386 2.4881 2.3439 1.4539 1.4797 1.5139 1.6015 1.2055 1.3087 1.2377 1.1748 1.2885 1.3231 1.3424 1.3742 1.3724 1.4723 1.2499 1.2250 1.1937 1.0662 1.0809 1.0720 1.0874 1.0830 1.0850 1.0986 1.0813 1.0375 1.0806 1.0608 1.0590 1.0594 1.0638 1.0653 1.1014 1.1008 1.1047 1.1022 1.1004 1.1048 1.0994 1.0735 1.0662
irintensity: 0.0091 0.6910 0.7511 1.9264 4.3414 0.6875 0.4551 5.5128 48.4542 88.2549 6.8817 4.1069 42.1322 12.8664 18.3790 7.8881 56.9802 5.9902 1.3009 9.6653 0.2364 4.9758 17.9114 3.6949 3.9851 54.5966 53.7471 3.9552 0.4243 4.4666 12.3825 1.3610 44.2161 41.9384 6.2309 12.1366 1.5272 2.1968 0.5903 1.7272 2.1506 1.1563 5.5180 0.0841 4.4160 3.9398 12.9706 27.3984 22.5387 23.3410 11.9299 6.0032 1.5429 7.3678 5.7726 8.9620 13.6146 5.5406 69.0642 23.7676 12.8370 43.7367 32.4290 45.2504 49.3936 53.8030 20.4290 10.8342 13.6898 13.9542 72.6659 108.8776 28.6812 1.6149 6.5409
temp: 298.150 k
press: 1.00000 atm
elementType: 8 7 6 6 6 6 6 6 6 6 1 1 1 1 1 1 1 1 1 1 1 1 1 1 1 1 1
symmnumber: 1
zpe: 634394.6 jmol-1
zpe.correction: 0.241628 hartree
zpe.thermalcorrener: 0.252632 hartree
zpe.thermalcorrenthalpy: 0.253576 hartree
zpe.thermalcorrgfe: 0.204198 hartree
zpe.sumelectzpe: -444.163463 hartree
zpe.sumelectthermal: -444.152460 hartree
zpe.sumelectthermalent: -444.151516 hartree
zpe.sumelectthermalfe: -444.200894 hartree
dipole: 1.9438 0.2780 0.6986
dipole: 2.0841
quadrupole: -74.9741 -58.0543 -64.0878
quadrupole: -2.6472 -1.2312 1.4755
quadrupole: -9.2687 7.6511 1.6176 -2.6472 -1.2312 1.4755
hfenergy: -444.4050916 hartree
pointgroup: C01 [X(C8H17N1O1)]
dipole: -0.7698993 -0.2636332 0.1004103 debye
polarizability: 114.4118828|-1.3621636|88.4659359|1.6643299|2.6972504|83.2266473 unknown
InChI: InChI=1S/C8H17NO/c1-7(6-10)9-8-4-2-3-5-8/h7-10H,2-6H2,1H3
charge 0 multiplicity 1
27 atoms
O  3.955786 -0.386192 -0.588971
N  0.377317 0.688952 0.003485
C  -0.941406 0.095133 0.320861
C  -2.069353 1.158382 0.243091
C  -1.408728 -0.971452 -0.702396
C  -3.383869 0.362056 -0.037764
C  -2.931107 -1.084758 -0.433503
C  1.575236 -0.16722 0.206502
C  2.728176 0.427626 -0.638213
C  1.994664 -0.346896 1.686759
H  -0.964462 -0.37062 1.338957
H  -1.834071 1.835529 -0.600773
H  -2.133241 1.772459 1.160413
H  -0.888439 -1.941367 -0.600825
H  -1.209867 -0.579168 -1.718617
H  -3.958566 0.837502 -0.852687
H  -4.043675 0.340526 0.848289
H  -3.114825 -1.783848 0.404461
H  -3.481601 -1.475042 -1.3077
H  0.497343 1.598879 0.473123
H  1.329594 -1.162576 -0.218045
H  2.372895 0.570923 -1.67841
H  3.037743 1.407793 -0.23202
H  1.197266 -0.837383 2.274513
H  2.207222 0.638072 2.146833
H  2.914059 -0.955176 1.761042
H  3.783507 -1.245434 -1.050603
