program: Gaussian 09
title: 000276939
version: EM64L-G09RevD.01
frameworkgroup: C1[X(C8H19NO)]
method: RPBEPBE
basis: SDD
operation: Freq
keyword: #p
keyword: freq=noraman
keyword: PBEPBE/SDD
title: #p freq=noraman PBEPBE/SDD
converged: YES YES NO NO
title: Mulliken charges:
elementType: O N C C C C C C C C H H H H H H H H H H H H H H H H H H H
charge: -0.441866 -0.313971 -0.433399 -0.059033 0.005511 -0.716576 -0.734038 -0.721960 -0.363022 -0.330924 0.189689 0.194120 0.217545 0.185237 0.241821 0.204397 0.214253 0.225516 0.224781 0.208142 0.210163 0.197538 0.248320 0.201200 0.193758 0.207958 0.208259 0.203672 0.332910
chargesum: 0.00000
title: Mulliken charges with hydrogens summed into heavy atoms:
elementType: O N C C C C C C C C
charge: -0.108956 -0.072150 -0.049591 0.158511 0.190749 -0.072411 -0.090951 -0.074902 0.038694 0.081007
polarizability: 1.09478516e+02 5.50958253e-01 9.79959708e+01 9.06495553e-01 1.75664319e+00 8.93501335e+01
1716.lowfreq: -20.9699 -9.1541 -4.9073 -0.0004 -0.0003 0.0004 24.4803 56.8116 78.1016
frequency: 23.7621 56.5937 78.0210 90.5458 126.8763 172.2857 176.0721 227.0359 240.7042 255.3215 276.0675 294.3729 323.4222 351.2608 357.7787 401.1242 437.1734 480.3554 571.6844 652.3402 769.6041 811.6394 839.4556 865.3408 910.6732 915.0569 954.5097 959.6435 978.8835 1018.7242 1028.8258 1052.0921 1063.6655 1098.3098 1111.3260 1123.3460 1166.4092 1191.0476 1203.3454 1248.7014 1275.7153 1286.7859 1296.4241 1312.4090 1326.8847 1337.5451 1355.7349 1363.6746 1368.4274 1376.3205 1384.0629 1387.3624 1442.2875 1457.6309 1464.5398 1470.3303 1471.6695 1475.5744 1478.5284 1484.9698 1489.5038 1495.9150 2901.1696 2937.7405 2952.5298 2965.5673 2966.8741 2970.7238 2977.8957 2979.4086 2990.7772 3010.0025 3053.4181 3062.3381 3063.3636 3068.9565 3070.7362 3072.5019 3087.1982 3421.9796 3562.2641
redmass: 2.8825 3.2713 1.8703 3.3739 2.3656 3.3411 2.1897 1.1752 1.1218 1.1407 2.1807 1.7548 1.4920 2.0757 2.4504 2.6065 2.3999 2.4901 2.4531 1.5458 2.7093 1.1758 1.7709 1.6123 1.5414 1.3673 1.6146 2.8064 2.0347 1.8339 1.9001 1.9821 2.1225 1.8413 1.7107 1.9823 2.1790 1.7754 2.0111 1.3901 1.1786 1.2788 1.2255 1.5041 1.2992 1.4034 1.2842 1.2860 1.2323 1.2308 1.3045 1.2322 1.1376 1.1006 1.0458 1.0764 1.0696 1.0587 1.0532 1.0551 1.0884 1.0539 1.0660 1.0703 1.0728 1.0359 1.0375 1.0390 1.0807 1.0683 1.0874 1.0976 1.0992 1.0989 1.0991 1.0997 1.1017 1.0989 1.0991 1.0738 1.0662
irintensity: 0.1607 0.4640 4.4270 3.4380 1.6527 1.6558 2.5889 1.7862 0.3194 0.3614 0.0241 29.9824 127.9861 0.2588 7.2348 0.4795 1.5962 20.0150 11.6773 104.7872 2.5025 8.2335 3.2516 3.2907 4.9196 9.7270 22.4950 74.9296 9.7130 18.2026 4.4699 2.4412 9.5816 9.6303 0.8158 56.9002 50.9641 8.1294 5.0290 1.3206 2.1718 1.2443 2.3983 11.1376 11.0684 7.4420 8.9625 5.1652 17.9688 11.9722 6.1885 19.1512 20.9240 9.6217 5.9908 2.8971 0.7201 6.7815 14.3789 8.7048 4.1131 13.5135 76.1508 17.5861 50.3216 63.3935 31.4126 12.5389 35.8214 55.6209 39.9977 41.0666 34.5860 45.5399 72.3950 38.6834 44.3160 48.1412 32.0653 1.0906 7.2263
temp: 298.150 k
press: 1.00000 atm
elementType: 8 7 6 6 6 6 6 6 6 6 1 1 1 1 1 1 1 1 1 1 1 1 1 1 1 1 1 1 1
symmnumber: 1
zpe: 686782.9 jmol-1
zpe.correction: 0.261582 hartree
zpe.thermalcorrener: 0.275116 hartree
zpe.thermalcorrenthalpy: 0.276060 hartree
zpe.thermalcorrgfe: 0.221119 hartree
zpe.sumelectzpe: -445.335206 hartree
zpe.sumelectthermal: -445.321671 hartree
zpe.sumelectthermalent: -445.320727 hartree
zpe.sumelectthermalfe: -445.375668 hartree
dipole: -1.5166 1.0728 0.8799
dipole: 2.0556
quadrupole: -76.0663 -66.5147 -60.5406
quadrupole: 0.9667 5.4707 -1.0673
quadrupole: -8.3591 1.1925 7.1666 0.9667 5.4707 -1.0673
hfenergy: -445.5967874 hartree
pointgroup: C01 [X(C8H19N1O1)]
dipole: -0.5804534 -0.442865 -0.3478213 debye
polarizability: 109.5053328|-0.1279944|97.9627697|-0.9509559|1.7426192|89.3565176 unknown
InChI: InChI=1S/C8H19NO/c1-7(2)6-8(3)9-4-5-10/h7-10H,4-6H2,1-3H3
charge 0 multiplicity 1
29 atoms
O  4.164812 0.960014 -0.171127
N  0.594581 -0.152074 0.41529
C  -1.815739 -0.819447 0.444025
C  -0.405576 -1.106425 -0.133467
C  -2.485819 0.551009 0.121917
C  -0.035432 -2.599741 0.103079
C  -2.410181 0.902676 -1.383313
C  -1.94866 1.720347 0.983529
C  1.967748 -0.237194 -0.12197
C  2.755572 1.036051 0.247616
H  -1.777394 -0.949743 1.548117
H  -2.480956 -1.623128 0.066344
H  -0.432253 -0.93486 -1.229107
H  -3.560618 0.423777 0.377894
H  0.583601 -0.153462 1.445734
H  -0.046569 -2.838417 1.184647
H  -0.756377 -3.271004 -0.400376
H  0.971331 -2.832926 -0.288656
H  -1.372565 1.14677 -1.676258
H  -2.763231 0.066164 -2.016526
H  -3.036636 1.785963 -1.608628
H  -2.044736 1.497539 2.063963
H  -0.882901 1.898832 0.76084
H  -2.517548 2.647971 0.78032
H  1.892777 -0.315618 -1.226746
H  2.55327 -1.120898 0.225379
H  2.805935 1.153841 1.344271
H  2.245439 1.925458 -0.17552
H  4.20423 0.914825 -1.159773
