program: Gaussian 09
title: 000276881
version: EM64L-G09RevD.01
frameworkgroup: C1[X(C9H8N2O5)]
method: RPBEPBE
basis: SDD
operation: Freq
keyword: #pfreq=noraman
keyword: PBEPBE/SDD
title: #p freq=noraman PBEPBE/SDD
converged: NO NO NO NO
title: Mulliken charges:
elementType: O O O O O N N C C C C C C C C C H H H H H H H H
charge: -0.421538 -0.306238 -0.238314 -0.206205 -0.206982 -0.447570 0.016666 0.345494 0.075541 -0.449509 -0.303779 0.429557 -0.376951 0.166800 0.217922 -0.785146 0.329728 0.324093 0.293051 0.383030 0.246660 0.267846 0.246629 0.399217
chargesum: 0.00000
title: Mulliken charges with hydrogens summed into heavy atoms:
elementType: O O O O O N N C C C C C C C C C
charge: -0.022320 -0.306238 -0.238314 -0.206205 -0.206982 -0.064541 0.016666 0.345494 0.075541 -0.119781 0.020314 0.429557 -0.083900 0.166800 0.217922 -0.024011
polarizability: 2.27110862e+02 -1.61535918e+00 1.60299912e+02 5.63786837e-03 4.41318312e-03 5.50202300e+01
1716.lowfreq: -35.3929 -4.6661 -0.0009 -0.0008 -0.0005 7.5655 10.5557 57.2102 64.8504
frequency: -35.3590 57.1504 64.8281 67.9896 99.2311 126.3336 155.9281 161.2113 166.2376 255.3707 282.4690 314.2016 323.0031 368.3577 425.3414 433.7204 480.7738 517.3998 527.5840 585.9594 592.7585 594.6598 618.9144 669.4743 672.7948 718.8394 734.6476 776.5172 803.7340 874.0796 883.2214 918.2303 934.7272 969.5387 989.8308 1021.4378 1022.7638 1037.5744 1088.7371 1125.0967 1158.0336 1204.0929 1228.5043 1247.0323 1296.3760 1328.9282 1359.9143 1380.1511 1400.8490 1426.2355 1443.4485 1462.9903 1466.3567 1523.6880 1584.3104 1589.4608 1630.9721 1657.1002 2992.9694 3078.2896 3142.2449 3177.9440 3194.4589 3199.9781 3250.7416 3529.0190
redmass: 1.0805 5.7133 8.5198 7.8802 6.1511 6.2295 4.8873 7.3488 6.6253 9.3800 5.1898 8.4288 6.1517 11.1703 5.1048 3.2885 7.4862 3.5105 5.5180 2.3760 1.3859 5.2863 5.7175 6.0491 5.9225 6.8234 9.1612 4.5946 4.8007 6.8154 1.4543 1.1265 6.2643 1.4379 1.7443 1.3223 3.7768 1.6820 1.7905 2.0778 1.6193 6.3124 3.9804 1.6143 1.9427 3.0086 10.3754 1.2370 7.9483 6.1502 1.2599 1.0458 2.1491 2.9821 4.3210 8.9022 7.8114 2.6614 1.0381 1.0979 1.0990 1.0909 1.0924 1.0961 1.0817 1.0643
irintensity: 1.1087 0.3724 1.3657 0.0320 8.4255 2.8400 0.3113 4.5004 0.3175 0.4019 1.2598 2.6286 3.1028 0.7450 4.7238 13.2534 28.3951 5.1210 7.1214 22.4902 96.4418 13.1454 41.0308 13.4955 61.0498 0.0260 20.5534 2.1689 1.7757 7.5126 47.9480 84.9152 3.4232 18.4857 43.1964 1.4546 217.4113 13.8365 119.5861 18.1328 139.9886 759.2594 8.5657 16.4316 30.3796 288.0108 187.6426 60.9098 33.4421 33.8703 29.2355 20.1345 40.5974 464.5364 264.9206 127.3242 333.6143 1.2094 2.5004 9.3719 8.5188 4.6490 14.5816 5.6608 199.5627 81.3329
temp: 298.150 k
press: 1.00000 atm
elementType: 8 8 8 8 8 7 7 6 6 6 6 6 6 6 6 6 1 1 1 1 1 1 1 1
symmnumber: 1
zpe: 439117.8 jmol-1
zpe.correction: 0.167251 hartree
zpe.thermalcorrener: 0.180932 hartree
zpe.thermalcorrenthalpy: 0.181876 hartree
zpe.thermalcorrgfe: 0.125932 hartree
zpe.sumelectzpe: -832.183841 hartree
zpe.sumelectthermal: -832.170160 hartree
zpe.sumelectthermalent: -832.169216 hartree
zpe.sumelectthermalfe: -832.225160 hartree
dipole: -5.1467 3.4892 0.0031
dipole: 6.2180
quadrupole: -109.4726 -89.2141 -91.0403
quadrupole: -2.5127 -0.0063 -0.0037
quadrupole: -12.8969 7.3616 5.5354 -2.5127 -0.0063 -0.0037
hfenergy: -832.3510917 hartree
pointgroup: C01 [X(C9H8N2O5)]
dipole: -2.0217816 -1.3767923 0.0373723 debye
dipolederiv: -0.4979289 0.5998954 -0.0139381 0.3949375 -1.1954715 0.0174845 -0.0090513 0.0166307 -0.4072437 -0.9963908 -0.183715 0.00651 -0.2137476 -0.8357118 0.0126232 0.0071716 0.0123984 -0.3350974 -0.6511945 -0.0678553 0.0023904 0.5725557 -1.0025353 0.0146752 -0.0132387 0.0164742 -0.3252441 -0.7706339 -0.2376724 0.0071899 -0.3572417 -0.7012726 0.0122258 0.0098956 0.0116009 -0.2297024 -0.886253 0.1580533 -0.0017596 0.3307986 -0.5909359 0.0073718 -0.0061222 0.008238 -0.2287011 -2.3685925 0.6229073 -0.0093544 0.6138546 -0.7370416 0.0092567 -0.009659 0.0094819 -0.288993 2.1796164 0.15791 -0.0095309 0.1135513 1.0377999 -0.0201783 -0.0084852 -0.0204634 0.1860804 1.6461131 -0.3904629 0.0049439 0.4174369 0.2038194 -0.0028464 -0.0145208 -0.0006104 0.1327319 -0.6389324 -0.3555501 0.0102481 0.124924 -0.7793503 0.0172776 -0.0011162 0.0186616 -0.0442467 0.3758566 0.3813194 -0.0104138 0.2682448 0.1793966 -0.006324 -0.0075224 -0.0067791 -0.0510189 -0.7114727 -0.0376351 0.0025351 -0.5357872 -0.013312 -0.0017806 0.0147428 -0.003286 -0.1477699 -0.9963811 -0.0836084 0.0048973 -0.0446722 -0.3767736 0.00997 0.004054 0.0102035 0.0369762 0.553582 -0.0978683 0.0004985 -0.2669774 0.1479148 -0.0047474 0.0045272 -0.0051513 -0.0776053 1.2215293 0.0314511 -0.0039809 0.1043158 2.0936678 -0.0441371 -0.005622 -0.0436333 0.2490994 2.0362635 -0.3250908 0.003493 -1.1801319 1.4141844 -0.0263781 0.0248322 -0.0289268 0.1854584 -0.4868225 -0.0868598 0.0031949 -0.2502486 -0.0705027 0.0030008 0.0067008 0.0025552 0.0355118 0.1374967 0.0417134 -0.0009127 0.0101189 0.1327084 0.0008742 -0.0001589 0.0007665 0.1691103 0.1558087 0.0356668 -0.0007969 -0.0114578 0.0905227 0.0021034 0.0003648 0.0020062 0.1751799 0.116696 -0.0496935 0.0013455 -0.0112132 0.0693476 0.0023305 0.0004878 0.0024089 0.1626353 0.2273621 -0.0171323 0.0005552 -0.0874239 0.4607293 -0.0037513 0.0020889 -0.003954 0.2941168 0.0730764 0.0041029 0.022132 -0.0149561 0.0463847 -0.1018028 -0.016458 -0.0984332 -0.0101725 0.009742 0.0521399 -0.0008847 0.1217102 0.0042875 0.0026923 -0.0024023 0.0028977 0.133325 0.0730799 0.0035216 -0.0227057 -0.0137684 0.0554553 0.0989143 0.0168451 0.0954535 -0.0192151 0.1983796 -0.1555372 0.0043439 -0.0848223 0.3666891 0.0011459 0.0026463 0.0014603 0.4047848 unknown
polarizability: 227.1019507|1.7531211|160.2468782|-0.5212579|-2.5254461|55.0821751 unknown
InChI: InChI=1S/C9H8N2O5/c1-5(12)10-8-3-2-6(11(15)16)4-7(8)9(13)14/h2-4,10,13H,1H3
charge 0 multiplicity 1
24 atoms
O  0.340911 -3.298311 0.104679
O  -1.837548 -2.531751 0.093535
O  -2.971813 2.349266 -0.021012
O  3.974983 1.795451 -0.026411
O  4.168085 -0.48088 0.026571
N  -2.217732 0.113806 0.031336
N  3.466604 0.605941 0.002535
C  -0.826059 0.264379 0.023635
C  0.006879 -0.920042 0.049682
C  1.414923 -0.792199 0.042457
C  -0.197023 1.547415 -0.009445
C  1.991832 0.484744 0.009932
C  1.19873 1.656469 -0.016175
C  -0.594121 -2.270536 0.08339
C  -3.215504 1.111037 0.009317
C  -4.628095 0.53858 0.025874
H  2.04867 -1.681513 0.062035
H  -0.830304 2.43521 -0.029514
H  1.6879 2.633978 -0.041437
H  -2.528752 -0.876678 0.055879
H  -4.799418 -0.111074 -0.851984
H  -5.349516 1.367314 0.008368
H  -4.795505 -0.070068 0.933369
H  -0.132027 -4.173436 0.126882
