program: Gaussian 09
title: 000276889
version: EM64L-G09RevD.01
frameworkgroup: C1[X(C11H14O2S)]
method: RPBEPBE
basis: SDD
operation: Freq
keyword: #p
keyword: freq=noraman
keyword: PBEPBE/SDD
title: #p freq=noraman PBEPBE/SDD
converged: YES YES NO NO
title: Mulliken charges:
elementType: S O O C C C C C C C C C C C H H H H H H H H H H H H H H
charge: 0.187862 -0.417898 -0.228693 -0.285757 -0.707799 -0.470312 -0.209375 0.446625 -0.216331 -0.236922 -0.406500 -0.348923 0.179473 -0.803800 0.230494 0.243058 0.255826 0.251186 0.250307 0.248973 0.250186 0.256573 0.232249 0.232957 0.231332 0.224318 0.234307 0.376584
chargesum: 0.00000
title: Mulliken charges with hydrogens summed into heavy atoms:
elementType: S O O C C C C C C C C C C C
charge: 0.187862 -0.041314 -0.228693 0.187795 -0.200788 0.028968 -0.209375 0.446625 0.033855 0.019651 -0.174251 -0.115966 0.179473 -0.113843
polarizability: 1.63544647e+02 -2.58965039e+01 1.36834563e+02 -3.44274160e+00 -9.48198056e+00 1.20333256e+02
1716.lowfreq: -17.7413 -6.3982 -0.0015 -0.0014 0.0026 6.5847 10.3473 16.6287 19.0731
frequency: 8.5191 16.5858 18.3936 26.4248 63.5524 82.3568 92.8935 109.8913 171.7712 233.2883 258.5046 276.0324 331.5861 357.6657 371.4505 407.9852 464.6985 500.7306 507.3687 576.9316 606.2539 632.3651 639.1201 671.1534 711.9670 733.5923 788.2899 819.6955 832.6853 850.6937 866.3252 957.2316 977.5762 984.5778 1004.9376 1013.0282 1035.5799 1047.7098 1062.5546 1076.8767 1077.5813 1113.0288 1132.4608 1186.1985 1218.2347 1220.3740 1251.4150 1253.2582 1283.8053 1291.6784 1311.6311 1359.6292 1365.6734 1391.5989 1397.5788 1435.5774 1440.8197 1470.5105 1473.3891 1474.1902 1479.2681 1575.0554 1605.0822 1670.6070 2978.1453 2989.7334 3006.8027 3016.4669 3035.8309 3056.9608 3066.2009 3085.8913 3091.7585 3122.2389 3124.1152 3149.7838 3156.9695 3514.5425
redmass: 1.0669 6.0006 6.4927 4.5098 2.4474 2.1412 6.0161 3.1180 2.9929 4.5486 6.5676 5.2799 5.6676 2.8405 6.3069 2.8640 4.1530 1.8337 2.6626 5.1207 5.4016 6.9629 1.3109 5.6469 2.9999 1.2046 5.0688 1.3638 1.4766 1.2439 4.5477 1.3076 1.3759 1.4456 3.8339 3.7418 1.5836 1.5634 2.6427 2.7410 2.9402 1.3126 1.2101 1.1244 1.3980 2.3137 1.2388 1.4604 1.0793 1.2884 1.5446 4.7292 1.8353 3.1221 1.2579 1.0951 1.0801 1.0490 1.0968 1.0903 2.4781 6.1412 6.2376 8.3079 1.0372 1.0607 1.0589 1.0587 1.0985 1.0974 1.1036 1.0989 1.1064 1.0885 1.0886 1.0958 1.0964 1.0640
irintensity: 0.5379 0.7879 0.6247 0.1221 0.9830 0.0875 0.1091 0.6856 0.8460 0.0501 0.8350 5.8215 0.6270 0.8261 0.1663 0.0556 52.6885 28.5315 14.3765 14.5669 1.6168 0.0138 129.7356 1.7732 1.1183 19.9168 1.7258 37.5499 17.4079 1.4317 0.7774 1.9385 0.5951 0.8974 20.0304 184.1408 15.2791 13.3459 3.2268 106.5253 8.9317 11.3258 0.6810 2.9037 7.7053 2.8318 1.4862 2.2320 0.1750 1.2003 82.5277 1.6130 31.0579 3.4768 11.3896 5.4333 26.1248 13.2282 11.8851 16.6395 37.4701 0.3885 2.8848 189.4980 34.9192 11.0817 9.9121 26.6359 3.3363 20.1106 1.0959 18.9380 33.9043 11.3511 18.3067 18.3813 1.8688 18.4996
temp: 298.150 k
press: 1.00000 atm
elementType: 16 8 8 6 6 6 6 6 6 6 6 6 6 6 1 1 1 1 1 1 1 1 1 1 1 1 1 1
symmnumber: 1
zpe: 586546.6 jmol-1
zpe.correction: 0.223404 hartree
zpe.thermalcorrener: 0.238875 hartree
zpe.thermalcorrenthalpy: 0.239819 hartree
zpe.thermalcorrgfe: 0.174617 hartree
zpe.sumelectzpe: -975.037073 hartree
zpe.sumelectthermal: -975.021602 hartree
zpe.sumelectthermalent: -975.020658 hartree
zpe.sumelectthermalfe: -975.085860 hartree
dipole: -0.1395 -1.5379 -2.1516
dipole: 2.6483
quadrupole: -79.0792 -91.3923 -90.9910
quadrupole: -6.6967 0.6169 -1.5507
quadrupole: 8.0749 -4.2382 -3.8368 -6.6967 0.6169 -1.5507
hfenergy: -975.2604768 hartree
pointgroup: C01 [X(C11H14O2S1)]
dipole: 0.1102504 0.6819608 -0.7800096 debye
polarizability: 162.8326119|-26.966446|135.3108818|3.6577705|9.1552221|122.5689719 unknown
InChI: InChI=1S/C11H14O2S/c1-9-4-6-10(7-5-9)14-8-2-3-11(12)13/h4-7,12H,2-3,8H2,1H3
charge 0 multiplicity 1
28 atoms
S  -0.288274 -2.596592 0.252558
O  5.044698 1.308527 -0.309879
O  3.572064 1.290052 1.48553
C  1.956204 -0.798055 0.274009
C  1.273631 -1.881573 -0.572973
C  3.202427 -0.233864 -0.439783
C  -1.428962 -1.15561 0.056421
C  -3.240651 1.032864 -0.2246
C  -2.097502 -0.938201 -1.170266
C  -1.668281 -0.284652 1.146318
C  -2.989422 0.150484 -1.306624
C  -2.567503 0.794788 1.002972
C  3.905478 0.839906 0.368698
C  -4.209466 2.194488 -0.364381
H  2.241928 -1.214853 1.256714
H  1.243312 0.021569 0.477551
H  0.970237 -1.499697 -1.56379
H  1.925105 -2.762115 -0.720067
H  2.938415 0.20368 -1.422792
H  3.941084 -1.030637 -0.656013
H  -1.929769 -1.624671 -2.007411
H  -1.153168 -0.456694 2.097119
H  -3.502513 0.309159 -2.262849
H  -2.74508 1.463069 1.854675
H  -3.727846 3.154298 -0.099946
H  -4.592678 2.281237 -1.395447
H  -5.079335 2.072492 0.308457
H  5.485966 2.011103 0.240997
