program: Gaussian 09
title: 000276885
version: EM64L-G09RevD.01
frameworkgroup: C1[X(C9H8INO4)]
method: RPBEPBE
basis: SDD
operation: Freq
keyword: #p
keyword: freq=noraman
keyword: PBEPBE/SDD
title: #p freq=noraman PBEPBE/SDD
converged: YES YES NO NO
title: Mulliken charges:
elementType: I O O O O N C C C C C C C C C H H H H H H H H
charge: 0.094806 -0.435681 -0.414985 -0.316478 -0.205896 -0.387839 0.352687 0.088103 -0.328448 -0.512713 -0.208921 -0.157041 -0.383027 0.151435 0.204192 0.368983 0.238223 0.278224 0.262036 0.290753 0.248354 0.388831 0.384403
chargesum: 0.00000
title: Mulliken charges with hydrogens summed into heavy atoms:
elementType: I O O O O N C C C C C C C C C
charge: 0.094806 -0.046849 -0.030581 -0.316478 -0.205896 -0.018855 0.352687 0.088103 -0.090225 0.027546 0.081832 0.091312 -0.383027 0.151435 0.204192
polarizability: 2.18564349e+02 4.82795054e+00 1.53070208e+02 -1.40375214e+01 9.97177073e+00 6.97892475e+01
1716.lowfreq: -6.0522 -1.8260 0.0003 0.0008 0.0009 5.7680 26.4046 37.5293 42.4856
frequency: 26.3004 37.5157 42.4852 75.6980 107.8123 122.1880 146.7956 187.7219 217.7396 246.6332 304.1098 320.2551 341.3035 387.7571 423.5055 470.8599 484.1279 522.3209 555.6247 573.7054 591.3657 612.4988 631.9928 658.6567 681.4972 732.9777 743.6680 780.2943 811.7746 817.5051 829.4397 924.2763 959.0221 996.3944 1010.3359 1026.8905 1081.3160 1106.2529 1146.3457 1174.2894 1242.4615 1254.3777 1266.2385 1309.4713 1345.0219 1356.0276 1381.8470 1405.0972 1448.3682 1456.6410 1507.4298 1570.9323 1603.8141 1632.5655 1688.0667 2999.9418 3061.9767 3152.8304 3173.7758 3187.1000 3340.5359 3519.1234 3537.4710
redmass: 8.6734 10.2859 7.5878 8.6664 9.8381 9.0763 4.6039 4.5635 9.1917 7.2721 4.2222 6.8234 5.3930 8.3242 3.1737 4.8490 1.9398 2.9999 4.3681 1.2341 5.3085 5.6956 1.4322 5.0706 5.0860 2.2767 2.8180 1.8347 1.6836 5.4851 4.6991 1.4154 1.3495 2.4988 4.4483 2.9979 2.4035 2.7154 2.1293 1.3706 1.2182 1.6253 1.4895 1.7307 2.3876 1.5689 6.2391 4.7302 2.2648 1.1388 3.7690 7.2887 2.6919 4.8507 8.6880 1.0629 1.0981 1.0873 1.0966 1.0925 1.0812 1.0643 1.0642
irintensity: 0.4110 1.0033 0.5793 0.2734 0.1721 0.0474 0.7488 1.5724 1.0044 0.9397 0.9548 0.2776 0.5737 7.8620 11.1218 60.3585 45.7533 17.1343 1.7649 149.4031 25.7004 27.4601 145.4186 23.3396 8.9258 21.4296 15.0482 83.6244 38.4938 37.5797 11.5768 8.7360 0.7795 34.1487 213.9377 396.6102 9.9497 109.5937 95.5705 40.4819 16.1434 52.5897 1.6387 53.1187 95.2483 24.2309 6.3390 3.1533 79.5635 27.0641 304.9040 156.0277 148.5535 241.9845 188.2445 34.6501 4.6539 5.6417 12.9137 2.1660 150.7897 28.2738 66.3080
temp: 298.150 k
press: 1.00000 atm
elementType: 53 8 8 8 8 7 6 6 6 6 6 6 6 6 6 1 1 1 1 1 1 1 1
symmnumber: 1
zpe: 420800.6 jmol-1
zpe.correction: 0.160274 hartree
zpe.thermalcorrener: 0.174609 hartree
zpe.thermalcorrenthalpy: 0.175553 hartree
zpe.thermalcorrgfe: 0.115491 hartree
zpe.sumelectzpe: -713.845975 hartree
zpe.sumelectthermal: -713.831640 hartree
zpe.sumelectthermalent: -713.830696 hartree
zpe.sumelectthermalfe: -713.890758 hartree
dipole: 2.7116 -0.9757 -1.4303
dipole: 3.2172
quadrupole: -91.3434 -86.4432 -106.7722
quadrupole: -8.7145 -3.8538 1.1892
quadrupole: 3.5095 8.4097 -11.9192 -8.7145 -3.8538 1.1892
hfenergy: -714.0062492 hartree
pointgroup: C01 [X(C9H8I1N1O4)]
dipole: -1.0495199 0.3502842 -0.6147818 debye
dipolederiv: -0.4233409 -0.1614648 -0.1362724 -0.1351049 -0.0698412 -0.0460876 -0.1393902 -0.0557313 -0.049808 -0.7923717 0.7537511 0.0322559 0.499374 -0.9843515 0.0292068 -0.0223688 0.116736 -0.4041826 -1.0898139 0.4407049 -0.1877472 0.588668 -0.8078739 0.1306712 0.010874 0.0281618 -0.2691867 -0.8469991 -0.3109885 -0.1922439 -0.2346867 -0.9820258 -0.1830294 -0.173706 -0.1994961 -0.426568 -0.603582 0.1688624 0.0385991 0.2358351 -0.4553377 0.091666 -0.0409789 0.2537562 -0.8246904 -1.5972591 0.131361 -0.1871019 -0.2250946 -0.3279647 -0.0842322 -0.4547956 0.0099483 -0.5362933 1.4308307 -0.051455 0.2747958 0.7201257 0.1157868 0.1486818 0.4588983 -0.0115201 0.2727857 -0.3354919 -0.3175173 -0.1137387 0.1738497 -0.9965458 -0.1305595 -0.0490686 -0.2451161 -0.1119616 -0.382378 0.0107234 -0.0528267 -0.5457008 0.0358882 -0.0653067 -0.1477073 0.0563673 -0.2340094 0.7656703 -0.144914 0.0338741 -0.424613 0.2761349 -0.0991604 0.1738915 -0.0703115 -0.0086496 -0.2598297 0.2536431 -0.0152871 -0.1009629 0.3637632 0.0380512 -0.0803038 0.1331099 -0.0266147 0.1401697 -0.3548499 -0.0167638 -0.2490375 0.1584802 -0.0349437 0.0184218 -0.0594587 -0.05578 0.8070477 0.5219865 0.3698735 0.5651557 -0.4601016 0.1034534 0.3800356 0.1074 -0.0927025 1.1281532 -0.1867146 0.2157894 -0.1705168 2.2243301 0.3096749 0.2112019 0.2657822 0.3415333 1.1129846 -0.6605054 0.0303023 -0.7674428 0.7973743 -0.1753 -0.0795654 -0.254503 1.0430175 0.2119077 -0.0121088 -0.0273467 -0.053883 0.3691556 0.0119312 -0.0194983 0.0373964 0.3107253 -0.0581842 0.0924561 -0.0428579 0.0831278 0.0162497 -0.0147224 -0.0481152 -0.0054149 0.14484 -0.053134 -0.0078387 -0.0464901 -0.0514428 0.0764793 -0.0728752 -0.0414648 -0.0367939 0.0808395 0.0446194 -0.0294784 0.0634482 0.1117895 -0.0628274 0.0972154 0.0308903 0.039763 0.0745575 0.0719617 0.0477185 -0.0147188 0.0662967 0.1094672 0.0108198 -0.0113382 0.0068876 0.1537636 0.115165 -0.0289499 -0.0131783 -0.0230409 -0.0433292 -0.0367054 -0.0156212 -0.0416383 0.1384945 0.2649704 -0.1782432 -0.0663014 -0.0955692 0.2908488 -0.0392596 -0.0519789 -0.0643148 0.3735232 0.3489038 0.0238216 0.0539364 0.0328738 0.3562402 0.0108104 0.0916878 -0.0110102 0.1063669 unknown
polarizability: 208.154134|8.1390251|153.4108629|36.086088|19.1524476|79.8588076 unknown
InChI: InChI=1S/C9H8INO4/c10-5-1-2-7(11-4-8(12)13)6(3-5)9(14)15/h1-3,11-12,14H,4H2
charge 0 multiplicity 1
23 atoms
I  4.486238 1.652122 1.301344
O  1.925708 -3.017049 -0.167729
O  -4.117312 1.974966 0.236469
O  -0.296461 -2.727339 -0.738605
O  -2.897169 0.572793 1.641281
N  -1.297743 -0.250192 -0.653441
C  -0.05469 0.163349 -0.211293
C  1.025254 -0.78789 -0.063623
C  0.219761 1.533306 0.096813
C  -2.439414 0.623599 -0.816511
C  2.310373 -0.351414 0.368012
C  1.492447 1.94534 0.51677
C  2.541558 0.999437 0.650439
C  0.7993 -2.208974 -0.351739
C  -3.128012 1.014969 0.5021
H  -1.39704 -1.268158 -0.794986
H  -0.571455 2.284258 0.021453
H  -3.199997 0.115154 -1.436221
H  -2.183371 1.55511 -1.356408
H  3.099699 -1.099571 0.469238
H  1.667487 3.000607 0.747054
H  1.677149 -3.956328 -0.37889
H  -4.590208 2.211704 1.079873
