program: Gaussian 09
title: 000277155
version: EM64L-G09RevD.01
frameworkgroup: C1[X(C13H6F3N3O7)]
method: RPBEPBE
basis: SDD
operation: Freq
keyword: #p
keyword: freq=noraman
keyword: PBEPBE/SDD
title: #p freq=noraman PBEPBE/SDD
converged: YES YES NO NO
title: Mulliken charges:
elementType: F F F O O O O O O O N N N C C C C C C C C C C C C C H H H H H H
charge: -0.156943 -0.152404 -0.153339 -0.283075 -0.170365 -0.169955 -0.179425 -0.176797 -0.184208 -0.191604 0.016041 0.021929 0.022309 0.227375 0.302023 0.320880 0.499654 -0.478582 -0.300484 -0.312857 -0.493150 -0.538663 0.472124 0.449122 0.276965 -0.525452 0.318943 0.283425 0.280560 0.312423 0.322989 0.340545
chargesum: 0.00000
title: Mulliken charges with hydrogens summed into heavy atoms:
elementType: F F F O O O O O O O N N N C C C C C C C C C C C C C
charge: -0.156943 -0.152404 -0.153339 -0.283075 -0.170365 -0.169955 -0.179425 -0.176797 -0.184208 -0.191604 0.016041 0.021929 0.022309 0.227375 0.302023 0.320880 0.499654 -0.159640 -0.017060 -0.032297 -0.180728 -0.215675 0.472124 0.449122 0.276965 -0.184907
polarizability: 2.92284226e+02 -1.18652033e+01 1.76560763e+02 1.16512493e+00 3.78086485e+00 1.42033267e+02
1716.lowfreq: -6.5491 -4.1099 -0.0001 0.0005 0.0008 1.4832 10.4564 14.3781 18.1139
frequency: 9.8352 14.2769 18.1047 25.2537 52.1819 53.9945 56.7866 85.3402 117.5829 122.5065 131.7467 138.3012 167.9885 192.1666 201.0214 221.3463 243.8487 287.3151 300.8213 329.8760 335.8238 352.9258 378.1003 391.8535 420.7752 427.3883 452.9687 469.2526 493.3836 506.6808 527.3688 533.7401 558.5953 590.1303 595.8455 624.2647 651.9026 654.9548 680.5075 687.2936 702.2928 707.1729 723.6207 729.1971 749.8156 770.4052 846.2350 853.0117 871.5111 914.2302 935.2297 938.1295 948.3715 955.1236 977.4445 985.7487 998.5869 1028.5154 1046.1222 1068.1956 1068.7523 1087.4578 1153.0794 1189.0024 1205.5526 1206.5212 1220.9895 1228.8462 1239.9391 1252.4735 1289.5493 1371.4378 1379.8518 1383.6240 1385.2436 1407.5784 1414.5871 1451.0434 1457.7830 1488.1713 1579.1048 1598.2610 1614.0958 1627.5641 3166.3730 3179.5426 3179.8324 3183.9996 3193.9159 3200.2261
redmass: 15.4862 13.0817 11.7747 12.0231 15.4386 15.2346 14.7659 9.3153 10.6288 13.0941 6.2600 13.3456 11.5534 5.0165 5.7522 11.2748 7.8811 10.9054 13.5227 11.9612 12.4585 9.7100 8.1809 8.1316 7.1967 4.9301 9.3538 5.8479 9.5533 11.7096 5.9184 8.4165 5.6949 9.4175 5.9532 4.6470 3.3938 8.3101 9.7945 7.7412 3.6009 10.9175 8.0430 11.2643 5.4058 7.7767 3.8442 1.9949 9.6933 1.5315 1.5046 1.4149 6.9248 1.5556 1.3812 6.2732 9.4278 5.2940 9.7684 2.8919 1.3997 1.5487 1.4793 3.5395 9.5698 14.3579 7.8246 1.2532 4.6941 1.9100 2.9998 5.7265 9.8336 10.1903 11.7112 5.5300 4.9399 5.1724 4.2163 3.2400 8.3577 8.3487 7.4781 7.6113 1.0896 1.0928 1.0924 1.0979 1.0932 1.0932
irintensity: 0.1437 0.1956 0.9679 0.9095 0.1960 0.2663 0.4381 1.4049 1.9109 6.5539 1.1164 5.0574 2.9067 0.0536 1.2226 0.6176 0.3310 1.8657 1.6934 6.4755 0.3367 1.6496 1.0756 2.3481 2.7638 1.2458 1.6492 0.0165 0.9046 1.5732 0.9224 6.2592 3.4301 15.9944 4.8089 19.9445 0.3454 14.3272 16.6393 18.3480 31.1666 10.0859 0.2538 38.1673 8.3589 26.4914 15.5901 52.6291 14.6219 17.4963 49.3417 7.2289 51.8671 38.8443 0.6115 0.8523 184.7134 155.2110 202.6864 66.6206 77.3602 8.0206 0.5528 20.7345 173.4190 290.6491 52.7251 4.3703 383.7964 276.4699 205.5557 103.0181 47.6424 72.7510 68.2454 8.5835 34.9654 5.3293 362.8768 51.3079 22.3516 7.0595 132.9471 7.6215 0.3425 10.8425 7.0631 1.5503 15.2330 30.3142
temp: 298.150 k
press: 1.00000 atm
elementType: 9 9 9 8 8 8 8 8 8 8 7 7 7 6 6 6 6 6 6 6 6 6 6 6 6 6 1 1 1 1 1 1
symmnumber: 1
zpe: 492008.6 jmol-1
zpe.correction: 0.187396 hartree
zpe.thermalcorrener: 0.209830 hartree
zpe.thermalcorrenthalpy: 0.210775 hartree
zpe.thermalcorrgfe: 0.130138 hartree
zpe.sumelectzpe: -1487.212879 hartree
zpe.sumelectthermal: -1487.190445 hartree
zpe.sumelectthermalent: -1487.189501 hartree
zpe.sumelectthermalfe: -1487.270138 hartree
dipole: -3.3571 -0.6485 -4.1584
dipole: 5.3835
quadrupole: -186.4661 -168.4727 -145.1071
quadrupole: 3.2382 3.6042 -0.7728
quadrupole: -19.7842 -1.7907 21.5748 3.2382 3.6042 -0.7728
hfenergy: -1487.4002756 hartree
pointgroup: C01 [X(C13H6F3N3O7)]
dipole: 1.2447407 0.1630683 -1.7059183 debye
polarizability: 290.7242256|-16.5276161|177.4376192|-8.4392781|-3.7859283|142.7164104 unknown
InChI: InChI=1S/C13H6F3N3O7/c14-13(15,16)7-1-2-12(11(3-7)19(24)25)26-10-5-8(17(20)21)4-9(6-10)18(22)23/h1-6H
charge 0 multiplicity 1
32 atoms
F  5.750871 -0.4161 -1.849638
F  5.899169 -0.03154 0.386551
F  5.15986 -2.033187 -0.379098
O  -0.271571 1.353879 -0.737826
O  2.150405 2.057748 2.585741
O  0.023068 1.470499 2.00243
O  -6.206025 0.776695 -0.036291
O  -3.731971 -3.306416 1.088404
O  -5.070135 2.621751 -0.753865
O  -1.458541 -3.329567 0.888719
N  1.292432 1.526177 1.786128
N  -5.122894 1.403384 -0.338399
N  -2.60724 -2.748586 0.80723
C  1.008596 0.776667 -0.627076
C  1.811873 0.913343 0.537041
C  3.689839 -0.11493 -0.614687
C  -1.428365 0.630533 -0.382807
C  3.152874 0.480261 0.541083
C  1.570888 0.198249 -1.785735
C  2.901202 -0.2593 -1.781882
C  -1.400009 -0.709385 0.049373
C  -2.640387 1.33664 -0.51591
C  -3.833864 0.663436 -0.200249
C  -2.630247 -1.32869 0.349593
C  5.105086 -0.632367 -0.609694
C  -3.869028 -0.673937 0.239368
H  3.753605 0.628746 1.442823
H  0.954701 0.13196 -2.686639
H  3.330486 -0.705859 -2.683447
H  -0.473664 -1.278225 0.163786
H  -2.655649 2.37796 -0.845556
H  -4.808666 -1.174842 0.48153
