program: Gaussian 09
title: 000276873
version: EM64L-G09RevD.01
frameworkgroup: C1[X(C15H17BrO3)]
method: RPBEPBE
basis: SDD
operation: Freq
keyword: #p
keyword: freq=noraman
keyword: PBEPBE/SDD
title: #p freq=noraman PBEPBE/SDD
converged: YES YES NO NO
title: Mulliken charges:
elementType: Br O O O C C C C C C C C C C C C C C C H H H H H H H H H H H H H H H H H
charge: 0.044125 -0.212626 -0.188310 -0.196677 -0.151449 -0.365538 0.106441 -0.470841 0.528893 -0.481986 -0.214904 -0.727917 0.164738 -0.142081 -0.023299 -0.736688 -0.467610 0.185312 -0.831364 0.259900 0.273041 0.225063 0.238671 0.231122 0.219728 0.263765 0.245771 0.215330 0.271459 0.263802 0.218231 0.250281 0.236274 0.246398 0.291079 0.231867
chargesum: 0.00000
title: Mulliken charges with hydrogens summed into heavy atoms:
elementType: Br O O O C C C C C C C C C C C C C C C
charge: 0.044125 -0.212626 -0.188310 -0.196677 0.108452 -0.092498 0.106441 -0.007108 0.528893 -0.031136 0.048861 0.004642 0.164738 0.121722 -0.023299 -0.031902 -0.467610 0.185312 -0.062020
polarizability: 2.68775781e+02 -1.84296173e+01 1.70394029e+02 6.50598775e+00 -6.17215390e+00 1.23442306e+02
1716.lowfreq: -9.8748 -0.0008 -0.0003 0.0003 3.5415 6.0164 39.4149 45.7863 76.3604
frequency: 39.3410 45.7643 76.3571 89.0634 100.0829 122.6323 138.3898 167.1391 179.7267 190.1024 204.6330 222.4711 237.4081 249.1733 268.7571 278.7420 305.9013 313.5116 363.7151 369.1253 398.7620 420.9438 455.5045 467.5683 494.9082 506.4936 539.1556 582.2008 610.0481 665.9449 685.3290 698.0133 712.2495 744.6709 757.0942 775.8307 816.0694 830.3618 854.6837 886.1018 898.6750 919.5897 925.9188 957.4830 974.2549 995.9739 1015.2215 1026.8633 1039.5038 1057.5046 1062.8134 1086.6067 1100.2060 1133.3380 1142.8833 1159.8392 1174.7377 1189.0743 1195.4503 1222.3708 1245.2203 1272.2702 1283.0476 1307.4041 1321.0571 1326.1221 1330.9803 1341.7244 1350.5595 1373.0030 1387.4809 1395.1045 1398.0923 1456.6346 1463.0103 1464.5631 1468.8740 1472.8323 1483.5590 1488.8547 1493.9331 1557.4905 1604.5746 1634.5299 1703.4003 2953.5406 2980.5607 2984.0049 2991.8920 2995.1089 2997.4309 3018.9218 3038.7975 3041.7170 3056.4089 3070.0243 3090.6322 3094.1148 3099.2113 3105.8086 3119.9981 3122.5191
redmass: 7.1024 5.9025 6.7381 3.5933 2.7203 1.2462 5.0496 2.1165 1.9546 3.1910 2.8744 1.7265 3.1483 2.3026 4.7916 2.6684 4.1326 2.1761 5.3480 4.3013 4.9109 3.3161 4.2747 3.2052 4.2733 4.6017 3.4850 5.8946 5.7820 3.3231 4.3509 5.3074 5.5465 4.3439 4.0720 6.2506 3.4222 3.2011 3.5053 1.4576 2.5097 2.4103 2.1129 2.2769 1.6076 1.7096 2.2311 1.8713 1.5405 2.2193 2.2259 2.4181 2.2227 2.4260 2.0775 2.1652 2.3911 1.8845 1.7770 2.2414 1.7317 1.3036 1.4029 1.5055 1.5845 1.5858 1.6854 1.3698 2.3178 1.6102 1.1926 1.2134 1.1969 1.0747 1.0561 1.0699 1.0781 1.0510 1.0546 1.0590 1.0665 10.9173 8.9205 8.6488 12.2766 1.0810 1.0598 1.0401 1.0388 1.0561 1.0399 1.0855 1.0911 1.0957 1.1013 1.0940 1.0996 1.1004 1.0995 1.0991 1.0991 1.0918
irintensity: 1.5330 2.8047 3.5973 0.0886 1.5207 1.1890 0.4959 0.3238 0.7873 1.3073 0.9271 1.7024 3.5227 2.0791 3.9702 0.7059 0.9045 1.1507 0.9902 9.3118 3.6597 0.0738 2.0453 1.4089 8.4387 5.3633 2.2916 14.5744 0.2190 0.9289 0.7579 11.7154 23.5310 3.6079 18.8455 11.2730 14.0544 68.6975 82.5009 22.3568 64.0274 4.8676 37.0232 13.5879 18.8672 20.7247 111.0952 12.9739 5.4981 61.2228 19.2020 7.2840 68.1408 31.9230 0.7157 17.2950 13.7666 25.5332 2.0200 6.9943 16.3659 0.6820 1.1707 5.3365 0.6401 2.7847 3.8565 6.2263 0.9861 5.0405 15.3824 35.9106 19.9877 5.2276 1.3786 40.2694 11.8249 6.0601 10.1058 19.6784 9.7626 174.7785 41.1943 25.1548 328.2525 12.5792 25.3152 16.3607 18.4537 13.3374 38.4877 5.5073 38.8233 4.1274 41.6423 12.1506 15.1473 17.5012 22.6603 1.3689 8.1013 5.9160
temp: 298.150 k
press: 1.00000 atm
elementType: 35 8 8 8 6 6 6 6 6 6 6 6 6 6 6 6 6 6 6 1 1 1 1 1 1 1 1 1 1 1 1 1 1 1 1 1
symmnumber: 1
zpe: 750819.9 jmol-1
zpe.correction: 0.285972 hartree
zpe.thermalcorrener: 0.304282 hartree
zpe.thermalcorrenthalpy: 0.305227 hartree
zpe.thermalcorrgfe: 0.239453 hartree
zpe.sumelectzpe: -819.505923 hartree
zpe.sumelectthermal: -819.487612 hartree
zpe.sumelectthermalent: -819.486668 hartree
zpe.sumelectthermalfe: -819.552442 hartree
dipole: 3.4022 -3.5616 -3.9932
dipole: 6.3408
quadrupole: -146.7771 -117.7392 -124.6475
quadrupole: 4.4257 -19.6725 -4.1155
quadrupole: -17.0558 11.9821 5.0738 4.4257 -19.6725 -4.1155
hfenergy: -819.7918948 hartree
pointgroup: C01 [X(C15H17Br1O3)]
dipole: -1.4357577 -1.3731891 1.5087556 debye
polarizability: 271.2963238|9.6398685|167.2152714|6.0753115|8.0449419|124.1005204 unknown
InChI: InChI=1S/C15H17BrO3/c1-7-9-4-5-15(3)6-10(16)12(17)8(2)11(15)13(9)19-14(7)18/h6-7,9,13H,4-5H2,1-3H3
charge 0 multiplicity 1
36 atoms
Br 5.046815 -1.134781 -0.120256
O  -1.757838 0.952997 -0.954687
O  -3.99834 0.819049 -1.56174
O  3.841636 1.715399 0.279238
C  -1.847282 -0.292362 1.114111
C  -0.979308 0.740609 0.337793
C  0.712994 -1.092375 -0.360327
C  -1.579222 -1.741329 0.647307
C  0.454619 0.349174 0.061007
C  -0.071762 -2.057974 0.599863
C  -3.278236 0.216479 0.771765
C  0.252095 -1.311903 -1.850445
C  -3.126467 0.681349 -0.690859
C  2.17511 -1.473752 -0.321688
C  1.463345 1.268533 0.251488
C  -4.463224 -0.741138 0.975001
C  3.173045 -0.578002 -0.100128
C  2.909125 0.866496 0.144279
C  1.23496 2.730082 0.600076
H  -1.63309 -0.207365 2.195685
H  -1.011296 1.71243 0.860398
H  -2.025016 -1.909741 -0.351679
H  -2.080431 -2.446999 1.33545
H  0.364155 -1.977292 1.615473
H  0.084324 -3.09994 0.260344
H  -3.463941 1.140551 1.362603
H  0.867224 -0.700428 -2.532053
H  0.371381 -2.375753 -2.12718
H  -0.797192 -1.014287 -1.995233
H  2.402426 -2.526851 -0.531011
H  -4.606078 -0.96937 2.045917
H  -5.387602 -0.278436 0.588635
H  -4.317684 -1.690324 0.432428
H  0.444442 3.1831 -0.021548
H  2.173857 3.284126 0.442013
H  0.959056 2.860931 1.664059
