program: Gaussian 09
title: 000276838
version: EM64L-G09RevD.01
frameworkgroup: C1[X(C22H16N2O4)]
method: RPBEPBE
basis: SDD
operation: Freq
keyword: #p
keyword: freq=noraman
keyword: PBEPBE/SDD
title: #p freq=noraman PBEPBE/SDD
converged: YES YES NO NO
title: Mulliken charges:
elementType: O O O O N N C C C C C C C C C C C C C C C C C C C C C C H H H H H H H H H H H H H H H H
charge: -0.193606 -0.193605 -0.219811 -0.219817 0.022764 0.022769 0.435785 0.435811 -0.594778 0.221378 0.221374 -0.597421 -0.342787 -0.342792 -0.293013 -0.293004 0.488460 0.488461 -0.380267 -0.401521 -0.380266 -0.401521 -0.236175 -0.237701 -0.236176 -0.237700 -0.233470 -0.233470 0.235900 0.328476 0.291069 0.291059 0.217031 0.217035 0.241924 0.229666 0.241919 0.229666 0.234844 0.233142 0.234844 0.233142 0.236190 0.236190
chargesum: 0.00000
title: Mulliken charges with hydrogens summed into heavy atoms:
elementType: O O O O N N C C C C C C C C C C C C C C C C C C C C C C
charge: -0.193606 -0.193605 -0.219811 -0.219817 0.022764 0.022769 0.435785 0.435811 -0.358878 0.221378 0.221374 -0.268945 -0.051717 -0.051734 -0.075982 -0.075968 0.488460 0.488461 -0.138343 -0.171856 -0.138347 -0.171855 -0.001330 -0.004558 -0.001331 -0.004557 0.002720 0.002720
polarizability: 6.01485725e+02 2.73951618e-03 4.78158334e+02 -1.98457670e+01 -1.38571299e-03 1.20698309e+02
1716.lowfreq: -3.1646 -0.0009 -0.0006 -0.0003 1.3903 1.5306 19.7992 24.9394 26.6791
frequency: 19.7335 24.9334 26.6685 32.9289 34.4605 44.5990 46.6548 61.6432 80.6434 96.2212 119.1496 138.0157 155.6547 176.6230 194.4019 201.1697 231.8611 244.7188 261.6582 285.8584 329.8050 342.2979 372.4604 380.3752 401.2743 401.3533 437.3570 453.6774 475.6135 477.9484 501.4243 508.3213 572.3516 579.1538 613.4772 613.8862 616.2120 623.8507 641.3826 675.7729 687.8261 692.4706 693.1481 726.1552 726.3901 756.7096 767.1482 772.7871 774.4352 815.5450 846.4999 847.1513 856.7759 857.2672 885.0427 894.2422 909.4338 932.3607 933.2051 961.0587 982.4799 982.5022 987.1724 987.2161 989.6589 990.3665 1004.8207 1004.8769 1025.2751 1026.0557 1036.8583 1085.7478 1088.1345 1088.8810 1165.3650 1175.7725 1175.7966 1182.7163 1192.5340 1194.0033 1195.7986 1198.3499 1234.1248 1239.3010 1274.1528 1293.5994 1298.3594 1301.2174 1308.4201 1340.2225 1342.4017 1350.3010 1369.8452 1385.6353 1390.3547 1400.1670 1410.3572 1441.4198 1441.7383 1463.8102 1485.4463 1488.6884 1534.3677 1577.5927 1579.4614 1588.8883 1606.7848 1611.2848 1625.6313 1628.9237 3088.6925 3088.9728 3120.4390 3120.4940 3133.5603 3133.5885 3144.5209 3144.5441 3155.6336 3155.6656 3170.1144 3170.2192 3171.2678 3186.4016 3186.4962 3191.1086
redmass: 6.5500 5.4045 3.6793 5.3956 9.9345 12.6631 7.6161 5.9924 4.8792 4.3490 3.2929 6.6783 5.4060 5.6636 8.8116 4.5061 2.9058 3.7069 4.2073 5.0855 9.6687 7.4089 9.3354 9.8845 2.7652 2.7677 3.2412 4.8525 4.8033 3.9483 3.1913 5.8287 6.1597 7.2328 6.4043 6.6182 6.8722 5.7998 6.9701 8.3868 7.2483 1.7868 1.7443 2.9741 7.4305 12.0629 3.6502 1.8316 2.3633 6.6427 1.3088 1.3032 3.4517 3.9235 1.7319 1.8627 1.7978 1.5548 1.6014 1.4474 1.3906 1.3863 4.5385 4.0331 1.3066 1.2737 1.2946 1.2988 2.2550 2.2069 2.9694 2.1886 1.6114 3.5871 1.9592 1.0629 1.0691 10.8406 1.5596 1.1373 4.6668 2.9407 1.6168 1.8850 1.3503 1.7745 1.6192 1.4915 2.7630 1.3054 1.4243 5.5131 5.4382 7.2182 6.9941 4.8828 4.2294 2.3358 2.3244 2.8262 2.2899 2.4570 9.2048 5.3539 5.4262 5.4558 5.6412 6.0058 5.2114 5.4814 1.0893 1.0896 1.0880 1.0880 1.0863 1.0863 1.0912 1.0912 1.0963 1.0963 1.1015 1.1015 1.0891 1.0883 1.0882 1.0910
irintensity: 0.0438 0.1074 0.5001 0.2005 0.0238 0.3314 1.1191 0.3205 0.1262 5.8659 1.1746 1.3606 5.9706 1.8872 2.2565 0.5678 0.4224 1.8877 0.9405 3.0421 0.1326 1.0859 6.5055 0.0038 0.0607 0.0539 1.2747 0.7437 6.7007 13.4158 16.5109 4.4558 15.1778 2.5510 0.4537 0.1217 0.2416 7.4038 5.0428 9.6673 22.2303 83.6749 6.3574 6.1824 0.4105 26.5331 0.0573 103.5775 9.5068 2.3667 0.6727 0.0008 26.2465 1.0535 1.4305 0.5612 4.6633 0.9227 0.2414 29.5924 1.5100 0.2259 22.6898 3.9474 0.0089 98.1930 0.3594 27.9719 4.3168 2.1365 27.6801 2.0029 10.8959 8.1383 21.5609 0.0170 4.8477 504.0423 196.8054 13.5544 359.9243 219.5721 12.7707 10.6851 32.8767 1.4209 63.7462 20.0830 37.7521 73.2388 29.9726 24.8107 147.0956 55.9922 11.1598 49.8509 19.5519 28.1899 0.2269 37.2202 2.5842 15.1006 155.4808 172.0576 39.3134 644.6193 65.2720 24.0013 233.9950 53.0596 24.3458 0.8416 13.3318 0.0613 1.5736 1.2803 14.6525 0.2586 11.2466 44.0071 61.2040 20.8002 3.2676 26.8397 18.6659 23.6462
temp: 298.150 k
press: 1.00000 atm
elementType: 8 8 8 8 7 7 6 6 6 6 6 6 6 6 6 6 6 6 6 6 6 6 6 6 6 6 6 6 1 1 1 1 1 1 1 1 1 1 1 1 1 1 1 1
symmnumber: 1
zpe: 855125.6 jmol-1
zpe.correction: 0.325700 hartree
zpe.thermalcorrener: 0.349681 hartree
zpe.thermalcorrenthalpy: 0.350625 hartree
zpe.thermalcorrgfe: 0.267498 hartree
zpe.sumelectzpe: -1256.224745 hartree
zpe.sumelectthermal: -1256.200765 hartree
zpe.sumelectthermalent: -1256.199820 hartree
zpe.sumelectthermalfe: -1256.282947 hartree
dipole: 0.0000 -9.8221 -0.0005
dipole: 9.8221
quadrupole: -146.5082 -175.1478 -165.7235
quadrupole: -0.0013 -1.3524 -0.0026
quadrupole: 15.9517 -12.6880 -3.2637 -0.0013 -1.3524 -0.0026
hfenergy: -1256.5504452 hartree
pointgroup: C01 [X(C22H16N2O4)]
dipole: -0.0007839 3.8642979 0.0014237 debye
polarizability: 597.8231205|0.0064009|478.1582958|46.2749686|0.1219046|124.3609521 unknown
InChI: InChI=1S/C22H16N2O4/c25-23(26)21-16-22(24(27)28)20(14-12-18-9-5-2-6-10-18)15-19(21)13-11-17-7-3-1-4-8-17/h1-16H
charge 0 multiplicity 1
44 atoms
O  2.312809 -4.768088 -0.03932
O  -2.311973 -4.769009 0.035375
O  3.480544 -3.037789 0.859994
O  -3.480214 -3.038394 -0.86267
N  2.404785 -3.534793 0.336182
N  -2.404374 -3.535416 -0.339047
C  -1.253556 -1.231781 -0.168652
C  1.253136 -1.231405 0.167348
C  -0.000333 -0.584072 -0.000445
C  1.208917 -2.672354 0.176216
C  -1.208787 -2.672696 -0.178466
C  0.000199 -3.365174 -0.001362
C  -2.486239 -0.443312 -0.298538
C  2.485491 -0.442504 0.29772
C  -2.626983 0.86118 0.112917
C  2.625695 0.862282 -0.112982
C  -3.835793 1.684015 -0.015637
C  3.834154 1.68555 0.016099
C  -5.041841 1.216592 -0.620338
C  -3.807067 3.018191 0.487961
C  5.040351 1.218297 0.620634
C  3.804917 3.019985 -0.486783
C  -6.16733 2.055757 -0.715631
C  -4.934609 3.858296 0.390985
C  6.165491 2.05787 0.716457
C  4.93211 3.860497 -0.389278
C  -6.121092 3.380026 -0.212004
C  6.118747 3.382389 0.213537
H  -0.000539 0.508257 -0.000095
H  0.000413 -4.45744 -0.001737
H  -3.338323 -0.967473 -0.733325
H  3.337774 -0.966551 0.732246
H  -1.786061 1.362011 0.615224
H  1.78458 1.363043 -0.615038
H  -5.100669 0.195996 -1.012932
H  -2.889248 3.391369 0.959715
H  5.099567 0.197517 1.01269
H  2.886978 3.393042 -0.958401
H  -7.085633 1.681438 -1.180909
H  -4.891502 4.879635 0.784234
H  7.083913 1.683676 1.181601
H  4.888613 4.88203 -0.781981
H  -7.000886 4.028164 -0.288228
H  6.99827 4.030845 0.29017
