program: Gaussian 09
title: 000276840
version: EM64L-G09RevD.01
frameworkgroup: C1[X(C24H20N2O4)]
method: RPBEPBE
basis: SDD
operation: Freq
keyword: #p
keyword: freq=noraman
keyword: PBEPBE/SDD
title: #p freq=noraman PBEPBE/SDD
converged: YES YES NO NO
title: Mulliken charges:
elementType: O O O O N N C C C C C C C C C C C C C C C C C C C C C C C C H H H H H H H H H H H H H H H H H H H H
charge: -0.196794 -0.196775 -0.222848 -0.222904 0.022296 0.022317 0.443588 0.443854 -0.599740 0.217597 0.217661 -0.602763 -0.351330 -0.351514 0.503825 0.503798 -0.301460 -0.301255 -0.382708 -0.402407 -0.382720 -0.402392 0.431249 0.431233 -0.358813 -0.425363 -0.358822 -0.425330 -0.804675 -0.804667 0.232652 0.328187 0.291430 0.291405 0.217021 0.216999 0.241192 0.227825 0.241173 0.227824 0.235995 0.235195 0.235998 0.235196 0.226797 0.235822 0.237264 0.237360 0.226794 0.235731
chargesum: 0.00000
title: Mulliken charges with hydrogens summed into heavy atoms:
elementType: O O O O N N C C C C C C C C C C C C C C C C C C C C C C C C
charge: -0.196794 -0.196775 -0.222848 -0.222904 0.022296 0.022317 0.443588 0.443854 -0.367089 0.217597 0.217661 -0.274575 -0.059900 -0.060109 0.503825 0.503798 -0.084440 -0.084256 -0.141516 -0.174582 -0.141547 -0.174569 0.431249 0.431233 -0.122818 -0.190168 -0.122824 -0.190133 -0.104792 -0.104782
polarizability: 7.00232940e+02 -4.47484673e-02 5.27049698e+02 -1.95817599e+01 -1.22963473e-02 1.37111066e+02
1716.lowfreq: -3.1882 -0.8734 0.0007 0.0008 0.0010 1.1929 19.1602 21.4299 26.7558
frequency: 19.1169 21.3949 26.7423 28.5536 29.3501 31.7978 33.3299 42.8353 43.2121 53.2556 60.9670 85.0025 115.6169 128.9815 155.5208 165.3245 171.6952 179.4345 188.7491 193.7836 232.0819 251.9911 313.5875 314.0760 335.0645 336.8287 348.1941 361.4639 372.6246 379.2953 406.5438 406.7094 438.6193 457.7767 463.6016 475.3085 503.4197 511.2960 536.5543 546.9129 615.1663 616.2163 627.8541 636.6438 636.7394 664.1399 686.8911 715.6749 718.3891 732.6160 734.3367 747.8158 756.6660 766.6142 788.2775 821.6847 824.5098 824.7398 845.6672 845.9002 859.4223 861.7764 889.1300 900.8755 911.4536 960.0831 960.1866 962.0383 982.1346 982.1657 986.5263 986.7260 993.8739 994.9016 1009.7841 1010.0677 1037.0785 1047.1004 1047.1153 1087.5403 1127.9123 1128.5244 1164.6946 1181.0519 1190.9284 1195.4672 1195.4988 1200.1218 1226.9493 1228.0163 1241.1005 1245.9216 1274.3138 1294.7928 1296.5418 1299.1503 1309.4517 1326.7461 1329.4243 1348.0411 1367.9138 1375.4890 1381.1432 1397.2466 1398.3231 1401.3008 1411.2159 1420.4233 1420.5249 1464.7639 1467.6010 1467.6120 1472.2864 1472.5946 1507.6216 1510.7402 1533.4816 1566.5597 1568.0110 1585.7762 1612.1075 1619.8388 1629.1442 1629.9692 2977.6683 2977.7095 3055.1883 3055.2239 3086.9913 3087.3162 3089.0320 3089.0571 3116.3355 3116.4036 3125.0798 3125.1148 3141.7846 3141.9099 3153.4912 3153.5428 3171.4369 3186.8768 3187.1010 3191.6089
redmass: 7.3891 4.4495 1.6425 1.1875 2.3098 2.5964 3.7421 7.8519 12.6618 5.4316 4.3093 5.0409 4.3469 4.5786 5.7430 4.7127 3.0933 3.1901 7.1676 4.6234 6.0174 3.6705 4.9405 4.2852 3.0049 3.2845 5.2637 5.5343 5.7794 9.0862 2.8193 2.8067 3.5606 4.7280 4.2497 5.8852 2.9202 2.6937 5.1645 6.4667 5.2308 6.9188 6.9219 6.9125 6.8791 8.1301 8.0288 3.2239 4.3317 4.6943 3.0233 5.2312 12.8241 4.4857 4.8557 3.1586 1.4682 1.8770 1.2959 1.2882 3.7601 4.4356 1.7836 2.0626 2.0195 1.3278 1.3460 1.4371 1.3776 1.3773 1.4276 1.4229 1.1590 1.1675 2.8611 2.8368 3.0299 1.5750 1.5750 8.1904 1.3723 1.3642 2.0255 11.3008 2.4598 1.1475 6.2885 1.6491 2.0501 2.3574 2.0565 2.1843 1.3494 1.8358 1.5772 1.4655 2.7635 1.3723 1.4698 6.6876 4.6681 4.3133 3.5845 1.4674 1.2747 2.9836 4.1157 3.3346 3.3295 2.8566 1.0456 1.0457 1.1183 1.1444 2.7162 2.7204 8.3813 5.2551 5.3186 5.2085 5.3110 6.1983 5.6369 5.5603 1.0375 1.0375 1.0972 1.0972 1.0893 1.0896 1.0988 1.0988 1.0876 1.0876 1.0883 1.0883 1.0962 1.0962 1.0963 1.0964 1.0890 1.0882 1.0882 1.0909
irintensity: 0.1146 0.1492 1.0952 0.0186 0.0368 0.2992 0.2638 0.8121 0.3890 0.2587 0.0501 5.6854 0.0269 2.1214 5.2004 0.6182 4.0701 2.5514 1.1834 1.3682 0.8360 1.4795 1.5519 0.7134 0.2061 8.4571 0.0172 0.7020 6.8416 0.0441 0.1168 0.7039 4.6338 3.4872 4.7949 15.4157 0.8475 34.0607 3.6929 0.0216 13.1596 0.0888 1.0087 0.7378 0.9580 2.2652 23.7091 5.0175 0.0206 0.0294 2.3042 3.0396 22.8658 3.2513 4.0849 33.4356 6.7973 53.5712 6.7632 0.1656 26.8532 1.3653 6.8105 1.5029 1.1464 0.4942 0.6380 35.6167 3.3043 0.1220 13.6369 5.2393 1.8551 140.6390 10.6675 5.5226 29.3590 2.6021 23.5912 1.6656 3.8715 31.8843 12.1802 553.3549 636.3007 54.6661 76.5000 195.2392 14.9463 1.0602 8.2526 13.3357 43.5781 4.7675 54.8638 22.0601 42.7340 89.4563 11.0426 46.2873 197.3894 37.0785 5.4747 79.6286 9.7392 44.8862 20.7584 0.0134 13.2914 20.8253 7.3058 20.2885 3.6343 61.0335 0.7837 26.9053 179.7602 131.4086 44.0790 1129.6139 355.9121 28.9091 80.6395 21.4849 54.3102 21.4776 15.1687 18.3180 22.8982 0.5481 9.5337 32.2561 19.0744 4.0377 41.1446 1.1871 8.8380 57.2761 16.0724 3.1978 2.9720 24.8069 22.1423 24.0411
temp: 298.150 k
press: 1.00000 atm
elementType: 8 8 8 8 7 7 6 6 6 6 6 6 6 6 6 6 6 6 6 6 6 6 6 6 6 6 6 6 6 6 1 1 1 1 1 1 1 1 1 1 1 1 1 1 1 1 1 1 1 1
symmnumber: 1
zpe: 996240.1 jmol-1
zpe.correction: 0.379448 hartree
zpe.thermalcorrener: 0.407308 hartree
zpe.thermalcorrenthalpy: 0.408252 hartree
zpe.thermalcorrgfe: 0.314741 hartree
zpe.sumelectzpe: -1334.685703 hartree
zpe.sumelectthermal: -1334.657843 hartree
zpe.sumelectthermalent: -1334.656899 hartree
zpe.sumelectthermalfe: -1334.750411 hartree
dipole: -0.0010 -11.0689 0.0000
dipole: 11.0689
quadrupole: -143.9130 -192.4360 -178.5789
quadrupole: 0.0051 -1.2434 0.0105
quadrupole: 27.7296 -20.7934 -6.9362 0.0051 -1.2434 0.0105
hfenergy: -1335.0651511 hartree
pointgroup: C01 [X(C24H20N2O4)]
dipole: -0.0021369 -4.3547278 -0.0299828 debye
polarizability: 697.1846455|0.2017158|527.0313012|-45.7236447|2.6724204|140.1777575 unknown
InChI: InChI=1S/C24H20N2O4/c1-17-3-7-19(8-4-17)11-13-21-15-22(14-12-20-9-5-18(2)6-10-20)24(26(29)30)16-23(21)25(27)28/h3-16H,1-2H3
charge 0 multiplicity 1
50 atoms
O  -2.304297 5.09702 -0.016659
O  2.31065 5.093782 0.094123
O  -3.490567 3.359409 0.842703
O  3.494605 3.365712 -0.787524
N  -2.404366 3.858596 0.341601
N  2.409144 3.859891 -0.279876
C  1.256899 1.553848 -0.13826
C  -1.254648 1.553113 0.170005
C  0.00081 0.907058 0.0117
C  -1.209531 2.995179 0.188917
C  1.213278 2.996037 -0.13819
C  0.002247 3.687211 0.029912
C  2.490212 0.767192 -0.260003
C  -2.488643 0.765845 0.280719
C  3.834315 -1.365277 -0.006272
C  -3.833759 -1.36231 -0.002825
C  2.622979 -0.549597 0.116884
C  -2.621972 -0.545609 -0.114143
C  5.056739 -0.882482 -0.565958
C  3.803515 -2.7137 0.45303
C  -5.056443 -0.88653 0.562274
C  -3.803143 -2.704469 -0.48015
C  6.148709 -3.064488 -0.200313
C  -6.149044 -3.062943 0.166439
C  6.182634 -1.716021 -0.658046
C  4.936425 -3.545704 0.356474
C  -6.18277 -1.720742 0.642246
C  -4.936472 -3.537206 -0.395674
C  7.376534 -3.948138 -0.30714
C  -7.377483 -3.947253 0.259964
H  0.00025 -0.185156 0.00456
H  0.00283 4.779374 0.037042
H  3.352556 1.301838 -0.660172
H  -3.350816 1.295516 0.687767
H  1.771035 -1.067078 0.582413
H  -1.77002 -1.057051 -0.586282
H  5.125669 0.149072 -0.927184
H  2.877674 -3.107963 0.890947
H  -5.125247 0.140146 0.93718
H  -2.877077 -3.093232 -0.922475
H  7.110512 -1.322069 -1.090442
H  4.883013 -4.57936 0.717623
H  -7.110827 -1.332242 1.079162
H  -4.883169 -4.5660 -0.770471
H  7.182024 -4.963356 0.077889
H  7.71233 -4.041665 -1.357095
H  8.223961 -3.525369 0.264961
H  -8.222101 -3.519412 -0.312573
H  -7.181349 -4.959138 -0.132936
H  -7.718305 -4.049679 1.307434
