program: Gaussian 09
title: 000276842
version: EM64L-G09RevD.01
frameworkgroup: C1[X(C24H20N2O6)]
method: RPBEPBE
basis: SDD
operation: Freq
keyword: #p
keyword: freq=noraman
keyword: PBEPBE/SDD
title: #p freq=noraman PBEPBE/SDD
converged: YES YES NO NO
title: Mulliken charges:
elementType: O O O O O O N N C C C C C C C C C C C C C C C C C C C C C C C C H H H H H H H H H H H H H H H H H H H H
charge: -0.252855 -0.252854 -0.200321 -0.200311 -0.226444 -0.226565 0.021824 0.021891 0.446325 0.446957 -0.604226 0.215541 0.215623 -0.605776 -0.357838 -0.358137 -0.304403 -0.304113 0.516359 0.516371 -0.363218 -0.412811 -0.363245 -0.412807 -0.362214 -0.369611 -0.362211 -0.369611 0.321274 0.321280 -0.536125 -0.536124 0.230480 0.328348 0.290736 0.290639 0.217304 0.217278 0.246264 0.228492 0.246230 0.228491 0.258386 0.244804 0.258388 0.244810 0.252028 0.226689 0.225141 0.226690 0.225143 0.252031
chargesum: 0.00000
title: Mulliken charges with hydrogens summed into heavy atoms:
elementType: O O O O O O N N C C C C C C C C C C C C C C C C C C C C C C C C
charge: -0.252855 -0.252854 -0.200321 -0.200311 -0.226444 -0.226565 0.021824 0.021891 0.446325 0.446957 -0.373746 0.215541 0.215623 -0.277428 -0.067101 -0.067498 -0.087099 -0.086835 0.516359 0.516371 -0.116954 -0.184319 -0.117016 -0.184316 -0.103828 -0.124806 -0.103822 -0.124801 0.321274 0.321280 0.167734 0.167740
polarizability: 7.77471586e+02 -5.42999898e-02 5.90983325e+02 -1.92638273e+01 -1.86105702e-02 1.42330537e+02
1716.lowfreq: -4.6601 -2.4044 -2.3209 -0.0006 -0.0003 0.0003 16.1774 18.0189 23.7813
frequency: 16.1216 17.9847 23.7649 27.9934 29.4933 41.1232 42.9465 46.4464 49.6857 76.4842 102.6730 116.4106 117.8854 131.7046 150.3992 164.8969 167.5863 178.3622 179.6321 183.3444 200.9595 226.7428 236.6073 252.5807 266.4150 275.5885 323.2900 333.0928 358.5596 363.7464 372.6662 380.7198 416.9394 417.1059 422.9888 434.1864 451.4308 455.1473 469.7671 500.1295 520.3224 522.0718 550.6373 551.9733 615.1170 615.6402 625.8856 630.8995 631.9966 662.1631 685.9769 718.5162 720.9018 733.7607 739.8875 741.0287 747.6488 756.0574 781.0011 810.4203 810.9680 820.5287 839.2453 839.6328 857.4438 859.0987 884.6544 894.3099 907.3634 945.8926 946.1227 963.3971 974.0590 974.1665 981.2049 981.5482 990.2060 991.2287 997.6940 997.8953 1036.9399 1087.5691 1110.6622 1110.6644 1117.8567 1118.5270 1157.0110 1157.2039 1164.9882 1177.8298 1178.1995 1179.4945 1195.9839 1197.3355 1228.4295 1232.5074 1252.3593 1254.5358 1274.1162 1293.5015 1294.5443 1297.0532 1309.2139 1319.9897 1324.9496 1347.2650 1366.0189 1379.6508 1387.4962 1402.9200 1411.4626 1434.9218 1435.0841 1437.6868 1438.0225 1465.5238 1468.0547 1468.0591 1470.7660 1470.9185 1501.9328 1504.8301 1531.4802 1562.6158 1565.0567 1583.6135 1612.0060 1620.4598 1627.0228 1627.3342 2966.9631 2967.1518 3058.6391 3058.6463 3086.6257 3086.9615 3123.2187 3123.2931 3133.3038 3133.3218 3148.7453 3148.7528 3166.0481 3166.1106 3169.5567 3173.7517 3173.7811 3187.2423 3187.6686 3190.9500
redmass: 5.5684 5.7120 3.7094 6.2828 4.9819 10.6108 13.2898 6.1089 5.0704 5.4607 4.6351 3.7886 5.0200 3.9392 6.3805 5.3056 5.2814 5.2136 2.1484 2.1689 6.3106 1.3859 1.3381 2.8466 4.1400 4.2967 6.6235 7.2206 8.4199 5.7349 4.6600 7.7589 3.0068 2.9188 5.3304 4.6523 3.8964 5.5703 4.5792 4.3554 3.0107 2.5206 4.9033 6.1549 5.2498 6.8005 7.1170 7.0023 6.8230 8.1661 8.2202 3.5172 7.1957 5.6224 4.4058 3.7006 4.9594 12.7560 5.6313 1.3299 1.3306 6.7869 1.5553 1.5153 3.6979 4.2630 1.8386 2.0538 1.9621 1.4071 1.4208 1.4395 1.3349 1.3384 8.8720 8.8724 1.1688 1.1704 2.6346 2.6031 3.0649 8.0470 1.2596 1.2596 1.4034 1.3889 1.3335 1.3293 2.0276 1.9577 1.5338 2.7645 6.6403 3.2567 1.7112 1.8955 2.6773 2.6760 1.3616 1.5276 1.6544 1.6071 2.3907 1.4431 1.7339 6.6868 4.8657 4.6467 4.0191 4.0702 3.9992 1.3071 1.2763 2.9478 3.0810 3.0542 1.0512 1.0511 1.0838 1.0811 2.5700 2.5880 8.6400 6.0642 6.3187 5.2584 5.2632 6.2807 5.7192 5.5341 1.0326 1.0327 1.1043 1.1043 1.0891 1.0894 1.0894 1.0894 1.0999 1.0999 1.0885 1.0885 1.0938 1.0938 1.0889 1.0968 1.0968 1.0881 1.0881 1.0908
irintensity: 0.3339 0.0031 0.4337 0.2454 0.4233 0.3661 0.5322 0.5350 0.0178 8.4252 0.1760 3.6869 0.7295 3.6681 2.1761 9.1805 5.5854 2.1826 6.4700 0.0034 0.7685 1.1542 0.1829 17.9747 2.5329 3.2557 1.4069 0.3579 12.5144 0.6459 0.7354 0.9747 0.3374 0.1933 0.2122 8.0435 3.2961 12.2453 37.1305 24.8893 2.1111 30.5559 49.8161 6.2429 10.5447 0.0010 1.2793 1.2204 7.4761 9.6326 22.4982 2.3969 0.0005 0.0172 0.0174 0.0626 15.6487 20.9438 0.9038 33.4389 3.9559 4.9110 6.7620 98.8912 24.3485 6.5046 7.5479 1.5837 0.9242 0.5957 7.9360 29.9049 0.1110 22.3443 58.6314 108.2538 6.9347 141.8276 6.6370 9.6491 29.6039 0.5307 0.1555 0.1653 6.8363 31.9075 27.5871 2.8032 11.2284 1053.6195 836.8742 21.5837 60.3864 542.6101 5.0285 131.2363 241.7189 403.2190 31.6924 38.8879 20.2191 11.9945 31.9982 126.8769 25.1827 53.4683 207.4057 102.0926 0.0342 140.5774 25.8947 80.1406 11.8389 65.2823 30.9340 16.0780 28.5058 6.4901 78.0509 55.1760 56.2906 192.2825 247.3352 479.0208 75.0617 1277.6964 661.9207 131.6944 8.6931 0.8489 57.6870 157.6914 9.1861 74.9506 19.8524 2.0291 20.1756 0.3581 43.3174 7.5042 1.6148 6.3228 7.7400 31.0590 3.2642 18.6679 0.3548 24.1680 23.3776 25.2632
temp: 298.150 k
press: 1.00000 atm
elementType: 8 8 8 8 8 8 7 7 6 6 6 6 6 6 6 6 6 6 6 6 6 6 6 6 6 6 6 6 6 6 6 6 1 1 1 1 1 1 1 1 1 1 1 1 1 1 1 1 1 1 1 1
symmnumber: 1
zpe: 1019724.2 jmol-1
zpe.correction: 0.388392 hartree
zpe.thermalcorrener: 0.417797 hartree
zpe.thermalcorrenthalpy: 0.418741 hartree
zpe.thermalcorrgfe: 0.323149 hartree
zpe.sumelectzpe: -1484.932922 hartree
zpe.sumelectthermal: -1484.903517 hartree
zpe.sumelectthermalent: -1484.902573 hartree
zpe.sumelectthermalfe: -1484.998165 hartree
dipole: -0.0011 -14.8464 0.0016
dipole: 14.8464
quadrupole: -170.1350 -185.5258 -188.4977
quadrupole: 0.0077 9.9069 0.0078
quadrupole: 11.2511 -4.1396 -7.1115 0.0077 9.9069 0.0078
hfenergy: -1485.321314 hartree
pointgroup: C01 [X(C24H20N2O6)]
dipole: 0.0008339 -5.8410431 0.0015129 debye
polarizability: 776.50525|-0.0197611|590.9832925|-31.3676573|-0.0919746|143.2969052 unknown
InChI: InChI=1S/C24H20N2O6/c1-31-21-11-5-17(6-12-21)3-9-19-15-20(24(26(29)30)16-23(19)25(27)28)10-4-18-7-13-22(32-2)14-8-18/h3-16H,1-2H3
charge 0 multiplicity 1
52 atoms
O  7.329093 -3.400246 -0.221488
O  -7.326229 -3.40432 0.221329
O  -2.302968 5.456793 -0.056436
O  2.302962 5.456712 0.05198
O  -3.501616 3.717152 0.782375
O  3.500813 3.714658 -0.783311
N  -2.407687 4.216426 0.296218
N  2.40717 4.215603 -0.298228
C  1.256972 1.90956 -0.144565
C  -1.257719 1.909503 0.144308
C  -0.000337 1.263601 0.000013
C  -1.213253 3.352908 0.155643
C  1.21238 3.352818 -0.156724
C  -0.00044 4.043674 -0.00082
C  2.491154 1.124192 -0.247404
C  -2.491501 1.123508 0.247044
C  2.622377 -0.191037 0.140714
C  -2.621638 -0.191978 -0.140571
C  3.834384 -1.003343 0.039767
C  -3.8331 -1.005093 -0.039703
C  5.059467 -0.52631 -0.528348
C  3.812226 -2.340195 0.530236
C  -5.058727 -0.528657 0.527735
C  -3.809819 -2.342155 -0.529551
C  6.19099 -1.345112 -0.598683
C  4.942264 -3.178205 0.466968
C  -6.189703 -1.34822 0.598021
C  -4.939294 -3.180926 -0.466327
C  6.14168 -2.677332 -0.101118
C  -6.139273 -2.680633 0.101082
C  7.350605 -4.778642 0.28271
C  -7.346589 -4.782959 -0.282248
H  -0.00031 0.171235 0.000133
H  -0.000456 5.135909 -0.001215
H  3.357763 1.658558 -0.638316
H  -3.358543 1.657384 0.637556
H  1.765707 -0.704324 0.602086
H  -1.764423 -0.704865 -0.601405
H  5.123647 0.495599 -0.915382
H  2.886818 -2.728634 0.973716
H  -5.123769 0.493389 0.914264
H  -2.883975 -2.730144 -0.972515
H  7.129826 -0.985478 -1.030089
H  4.882686 -4.198599 0.856264
H  -7.128954 -0.989044 1.028905
H  -4.878859 -4.201454 -0.855141
H  8.371329 -5.13703 0.087723
H  7.143612 -4.809158 1.369481
H  6.621286 -5.412764 -0.256702
H  -7.139163 -4.813829 -1.368927
H  -6.617031 -5.416326 0.257729
H  -8.367136 -5.141971 -0.087484
