program: Gaussian 09
title: 000276824
version: EM64L-G09RevD.01
frameworkgroup: C1[X(C18H15NO3)]
method: RPBEPBE
basis: SDD
operation: Freq
keyword: #p
keyword: freq=noraman
keyword: PBEPBE/SDD
title: #p freq=noraman PBEPBE/SDD
converged: YES YES NO NO
title: Mulliken charges:
elementType: O O O N C C C C C C C C C C C C C C C C C C H H H H H H H H H H H H H H H
charge: -0.283214 -0.217205 -0.196963 -0.387898 0.246714 -0.631579 0.493537 -0.385128 0.079197 0.133888 -0.507799 0.369877 -0.428393 -0.420312 0.436058 -0.362327 -0.233132 -0.427608 -0.379488 -0.222276 -0.218027 -0.237726 0.274966 0.276175 0.260932 0.349476 0.265690 0.240088 0.224004 0.224318 0.258646 0.230889 0.229323 0.255957 0.228819 0.229314 0.231207
chargesum: 0.00000
title: Mulliken charges with hydrogens summed into heavy atoms:
elementType: O O O N C C C C C C C C C C C C C C C C C C
charge: -0.283214 -0.217205 -0.196963 -0.038422 0.246714 -0.080437 0.493537 -0.124196 0.079197 0.133888 -0.242109 0.369877 -0.188305 0.028010 0.436058 -0.103680 -0.002243 -0.198285 -0.123531 0.006543 0.011287 -0.006519
polarizability: 3.21297679e+02 -1.35134632e+01 2.63038096e+02 1.27442653e+01 -6.67698616e+00 9.90810215e+01
1716.lowfreq: -4.9254 -0.0004 0.0005 0.0005 2.3934 4.2588 12.5527 20.0705 33.2820
frequency: 12.4887 20.0534 33.2724 43.0548 63.7088 85.6597 106.3921 139.8227 167.6703 168.6439 182.9046 224.2733 247.6663 263.1396 266.6672 311.3125 393.0081 402.0350 409.5326 442.1548 468.5807 488.2952 524.3942 534.1359 553.5943 586.1292 602.2008 614.3781 616.6373 631.0496 656.3852 685.1800 701.9039 703.8387 742.2979 747.3085 758.7703 790.5090 819.6972 827.5627 854.5956 879.2393 881.3685 885.6920 909.2090 917.9411 951.6122 965.4432 978.5434 981.4339 982.0669 990.1031 996.7143 1004.1250 1012.7997 1027.9426 1070.5952 1086.6473 1101.8010 1150.1332 1165.8048 1173.3635 1175.3481 1187.0416 1192.0322 1204.3422 1226.5796 1233.9549 1255.1216 1293.2658 1301.9900 1316.1988 1316.8918 1356.6709 1377.2883 1388.7236 1399.8135 1428.8122 1440.7908 1447.4247 1473.0739 1476.3771 1487.1422 1576.5661 1596.6821 1613.9848 1618.8189 1639.6430 1677.7157 1689.9777 2939.2825 2998.7850 3002.6551 3051.1711 3089.3430 3115.4236 3129.5997 3134.5204 3143.1173 3153.1828 3158.3018 3169.8087 3172.0980 3196.5044 3559.4577
redmass: 3.9268 7.3096 6.6984 5.4297 4.2712 6.0449 4.2817 3.7032 6.9162 6.7745 6.2542 3.4615 4.7017 3.7798 6.6875 4.1263 8.9612 2.8209 2.8950 3.5554 2.6273 3.6553 6.7042 5.6380 2.7229 7.7491 3.5342 7.0876 6.9316 6.5425 5.6662 1.9497 2.1134 1.8480 1.6184 2.1256 4.7643 1.5304 4.9661 4.0799 1.2514 3.0000 1.4459 1.5730 2.2929 1.9759 2.2518 1.3929 1.3892 1.4469 5.5259 6.1054 1.3486 2.9327 1.9588 2.1487 3.1932 1.5605 1.7129 1.1470 1.9591 1.0622 2.7859 1.1086 1.3005 1.2246 1.9396 1.7261 4.2400 3.0126 1.5183 1.4035 1.6894 1.6031 2.2557 5.4607 3.4385 1.0849 2.1457 2.4932 1.2590 2.2957 2.2476 5.5772 6.1809 6.4947 6.0971 8.1420 8.5642 11.6865 1.0577 1.0609 1.1032 1.1003 1.0881 1.0879 1.0867 1.0868 1.0923 1.0931 1.0961 1.0999 1.0971 1.0903 1.0794
irintensity: 0.2681 0.1288 0.1222 0.6458 0.6649 0.1358 4.3915 5.3809 1.6011 4.9776 2.1306 3.2227 0.9569 0.4201 1.7957 1.0048 24.2605 0.8521 2.0588 3.1633 13.1860 11.4298 3.9438 7.2029 4.9952 25.1637 0.1850 2.4950 3.0126 17.2210 8.4198 0.8631 44.8589 55.3904 65.3191 91.4905 24.6379 55.7927 20.2490 5.2090 0.1881 4.0402 3.1293 17.3340 11.8759 3.0725 0.9411 9.3015 0.0417 10.8533 2.6064 1.3726 0.5563 115.0557 35.2340 4.2099 55.0567 6.2292 1.8817 0.6866 169.7722 2.6022 193.3583 4.2905 23.9798 3.7668 2.6104 30.7030 360.3941 80.6016 111.3462 3.0910 13.9631 19.6096 22.3265 3.8184 18.3361 23.1194 34.0642 69.1257 17.4285 21.9531 10.6797 112.8641 0.9866 9.5366 3.4707 500.5823 251.8238 223.9308 29.0949 3.1193 27.8150 2.0100 1.7641 9.3469 0.5272 3.5058 23.2694 21.1497 34.3593 10.6595 15.6975 1.9514 80.1759
temp: 298.150 k
press: 1.00000 atm
elementType: 8 8 8 7 6 6 6 6 6 6 6 6 6 6 6 6 6 6 6 6 6 6 1 1 1 1 1 1 1 1 1 1 1 1 1 1 1
symmnumber: 1
zpe: 750112.4 jmol-1
zpe.correction: 0.285703 hartree
zpe.thermalcorrener: 0.304318 hartree
zpe.thermalcorrenthalpy: 0.305263 hartree
zpe.thermalcorrgfe: 0.235156 hartree
zpe.sumelectzpe: -973.814996 hartree
zpe.sumelectthermal: -973.796380 hartree
zpe.sumelectthermalent: -973.795436 hartree
zpe.sumelectthermalfe: -973.865543 hartree
dipole: -4.8691 2.9807 0.2601
dipole: 5.7149
quadrupole: -130.2064 -126.4572 -130.3765
quadrupole: -2.5067 2.3588 -2.7769
quadrupole: -1.1930 2.5562 -1.3632 -2.5067 2.3588 -2.7769
hfenergy: -974.1006988 hartree
pointgroup: C01 [X(C18H15N1O3)]
dipole: -1.910953 1.083019 -0.4802769 debye
polarizability: 317.143252|-0.982305|238.0722131|34.7609499|-58.7585404|128.2013315 unknown
InChI: InChI=1S/C18H15NO3/c20-17-11-15(18(21)19-17)9-14-7-4-8-16(10-14)22-12-13-5-2-1-3-6-13/h1-10,19H,11-12H2
charge 0 multiplicity 1
37 atoms
O  -1.804655 0.435518 -0.431378
O  5.931955 0.562525 0.326702
O  3.796262 -3.46747 1.476188
N  5.125558 -1.577243 0.966407
C  3.513211 -0.033226 0.286127
C  2.796314 -1.321672 0.643393
C  1.690772 1.635608 -0.439224
C  3.055634 1.178331 -0.156572
C  4.980399 -0.2404 0.501493
C  3.913485 -2.283391 1.084826
C  0.533038 0.823291 -0.306178
C  -0.748655 1.342732 -0.598026
C  1.527393 2.987329 -0.87594
C  -3.174345 0.926288 -0.678218
C  -4.152282 -0.186514 -0.359263
C  -0.902088 2.685083 -1.031357
C  0.249335 3.495556 -1.164751
C  -5.35837 -0.287356 -1.09514
C  -3.904878 -1.099502 0.695192
C  -6.313945 -1.277318 -0.772887
C  -4.855263 -2.095752 1.010331
C  -6.064645 -2.184963 0.281895
H  2.070844 -1.209358 1.470578
H  2.25075 -1.774255 -0.205818
H  3.846048 1.926791 -0.32247
H  6.034192 -1.985899 1.196074
H  0.588964 -0.217518 0.017056
H  2.411029 3.626008 -0.984261
H  -3.275737 1.245765 -1.735212
H  -3.355406 1.808902 -0.027195
H  -1.885906 3.100345 -1.266147
H  0.137406 4.53234 -1.499352
H  -5.552888 0.404973 -1.924117
H  -2.96279 -1.033863 1.248192
H  -7.243433 -1.345995 -1.348856
H  -4.652849 -2.802186 1.823116
H  -6.801352 -2.957303 0.529189
