program: Gaussian 09
title: 000276846
version: EM64L-G09RevD.01
frameworkgroup: C1[X(C25H15N3O4)]
method: RPBEPBE
basis: SDD
operation: Freq
keyword: #p
keyword: freq=noraman
keyword: PBEPBE/SDD
title: #p freq=noraman PBEPBE/SDD
converged: YES YES NO NO
title: Mulliken charges:
elementType: O O O O N N N C C C C C C C C C C C C C C C C C C C C C C C C C H H H H H H H H H H H H H H H
charge: -0.137194 -0.137221 -0.168980 -0.169015 -0.474927 -0.476835 -0.102135 0.258881 0.257455 0.344965 0.347656 0.281414 0.281776 -0.449957 -0.451730 0.246984 0.246236 -0.351266 -0.353499 -0.200946 -0.199194 -0.371377 -0.371022 0.054898 0.055587 -0.252125 -0.250987 -0.233586 -0.233474 -0.406078 -0.406264 -0.115760 0.312568 0.313123 0.320423 0.317605 0.203573 0.205309 0.294237 0.294056 0.236953 0.236986 0.245200 0.245110 0.234282 0.234745 0.243550
chargesum: 0.00000
title: Mulliken charges with hydrogens summed into heavy atoms:
elementType: O O O O N N N C C C C C C C C C C C C C C C C C C C C C C C C C
charge: -0.137194 -0.137221 -0.168980 -0.169015 -0.162359 -0.163712 -0.102135 0.258881 0.257455 0.344965 0.347656 0.281414 0.281776 -0.129534 -0.134125 0.246984 0.246236 -0.147693 -0.148190 -0.200946 -0.199194 -0.077140 -0.076966 0.054898 0.055587 -0.015171 -0.014001 0.011613 0.011636 -0.171796 -0.171519 0.127791
polarizability: 4.78458058e+02 -1.21847251e+00 4.10987931e+02 -5.28962202e+01 -6.55634984e-01 1.68954133e+02
1716.lowfreq: -6.0848 -0.0009 -0.0008 -0.0002 1.2744 4.4337 9.4006 15.7320 21.6608
frequency: 8.9498 15.7051 21.6587 37.5247 47.0313 56.0201 60.8077 81.7650 102.1864 116.8470 143.9437 153.3030 171.6792 192.8157 200.9660 201.4962 227.9510 245.7789 254.6555 306.5757 310.5503 338.4731 346.9581 347.0135 391.8595 393.0410 408.6915 414.1284 439.1095 445.1267 455.1206 455.9754 458.6299 508.4392 511.0396 546.6473 549.3032 575.4299 581.7814 590.5127 607.0148 622.4372 636.7703 640.4173 647.1873 660.5902 682.6805 692.1060 706.0135 707.0920 711.9553 720.1948 720.5894 770.0189 775.4001 791.1895 791.9321 826.1992 828.2210 830.0586 836.2196 851.6697 882.6280 890.7349 909.3065 928.0959 943.9097 944.5228 951.7373 970.3182 972.5262 973.0782 1009.7166 1009.9354 1016.1571 1045.1116 1048.9704 1074.9197 1089.4846 1094.4879 1131.8183 1133.6225 1177.3626 1183.7163 1184.0813 1202.4740 1205.8047 1207.5603 1228.3580 1243.2466 1246.2405 1287.0431 1289.2066 1289.3251 1302.7004 1326.2104 1340.0463 1372.6636 1385.3804 1385.8461 1434.9386 1435.1870 1436.6485 1453.4980 1473.2219 1476.9264 1506.0415 1530.4064 1540.2000 1544.1310 1569.2713 1569.6689 1580.2283 1580.5156 1586.5278 1596.9654 1615.3920 1616.8332 1618.1633 1620.9761 3117.8205 3119.2997 3139.2131 3143.0456 3143.2036 3146.4623 3154.5506 3154.8303 3171.2853 3171.3546 3171.8158 3203.9024 3204.4834 3544.3000 3545.1530
redmass: 6.5744 8.6931 8.4420 8.1099 11.4233 5.8667 6.2759 6.8567 4.5056 4.8970 6.5191 4.7104 7.4156 4.6549 6.0507 4.6917 4.8668 5.3866 6.9737 7.1974 7.0788 6.2598 13.6343 14.6596 3.7859 3.6421 8.1446 8.2376 4.4036 4.5238 7.9930 3.6077 7.0351 4.1270 4.0482 6.0641 6.0027 1.9779 1.4479 2.7948 5.4458 6.9519 4.2104 4.5262 4.3636 3.9168 6.7415 6.1196 7.0630 2.9900 2.4892 2.9748 2.9879 1.9172 1.5945 3.2178 2.6745 4.5507 2.4559 3.4702 2.3953 1.4968 1.4301 1.6364 2.3437 1.6777 7.0026 6.6979 6.3594 1.3291 1.4086 1.4099 1.3862 1.3818 4.9278 2.5790 2.3116 2.8276 2.9239 1.8105 1.9161 1.9801 1.1587 1.1139 1.1113 1.8152 2.9739 2.2425 2.6529 2.0177 2.0492 2.5958 2.2749 2.3144 1.8716 2.6322 3.1442 5.0438 9.1957 9.3733 2.4066 2.3673 2.4389 6.2108 2.5501 2.4486 2.3716 2.4277 10.3842 6.7177 6.7893 7.0273 7.1985 7.6385 3.6528 3.5762 5.8645 6.1492 8.2547 5.9113 1.0875 1.0875 1.0879 1.0883 1.0883 1.0927 1.0933 1.0933 1.1006 1.1006 1.1002 1.0914 1.0913 1.0749 1.0749
irintensity: 2.5364 0.5300 0.2968 0.1526 0.1815 0.0633 0.5682 0.4675 0.1597 4.0107 0.2052 0.0097 4.3760 0.8277 3.0986 0.2671 0.6041 7.8233 0.2235 7.8684 1.3934 3.4911 2.3972 5.4111 0.1009 0.2931 0.4021 0.2063 7.2570 0.0253 0.1697 28.7958 2.4892 2.8864 3.5622 9.9947 0.1787 0.0739 75.5265 13.9902 19.4877 0.9902 1.8115 15.6336 22.8680 3.0163 0.3162 5.8001 0.0410 27.5307 31.9874 10.6586 30.1105 17.0068 89.9730 25.0570 97.0452 2.9624 15.6311 1.3292 0.0776 0.0837 14.0227 0.1014 32.5137 1.8073 48.7349 0.5197 1.7086 0.5140 5.2394 1.8128 1.4535 0.7750 5.0349 0.0653 8.6554 9.5103 26.2776 15.9215 0.3917 3.5973 66.3798 0.3798 0.1151 0.3194 139.8332 15.8947 15.0867 27.3206 93.5488 38.0211 49.9094 38.0452 23.9813 4.6996 0.0609 73.5200 3.6478 7.8337 33.0111 96.7036 105.0136 203.6491 440.8713 2.6292 548.8260 0.2543 172.6619 432.6861 34.0073 50.9672 40.8961 201.2759 451.2010 37.3756 9.1752 12.0577 43.4347 44.8944 17.9744 16.8503 2.6932 7.6524 8.2045 13.9961 4.2841 4.3723 34.8390 15.8864 14.6134 0.2607 12.6252 39.4686 29.3421
temp: 298.150 k
press: 1.00000 atm
elementType: 8 8 8 8 7 7 7 6 6 6 6 6 6 6 6 6 6 6 6 6 6 6 6 6 6 6 6 6 6 6 6 6 1 1 1 1 1 1 1 1 1 1 1 1 1 1 1
symmnumber: 1
zpe: 894604.9 jmol-1
zpe.correction: 0.340737 hartree
zpe.thermalcorrener: 0.366100 hartree
zpe.thermalcorrenthalpy: 0.367044 hartree
zpe.thermalcorrgfe: 0.281989 hartree
zpe.sumelectzpe: -1424.641418 hartree
zpe.sumelectthermal: -1424.616055 hartree
zpe.sumelectthermalent: -1424.615111 hartree
zpe.sumelectthermalfe: -1424.700166 hartree
dipole: -0.1065 15.3674 -0.1821
dipole: 15.3689
quadrupole: -118.6371 -188.4717 -196.4130
quadrupole: 0.0312 -24.8173 0.3609
quadrupole: 49.2035 -20.6311 -28.5724 0.0312 -24.8173 0.3609
hfenergy: -1424.9821548 hartree
pointgroup: C01 [X(C25H15N3O4)]
dipole: -0.0723084 6.043081 -0.1925247 debye
polarizability: 483.7018051|-1.4230864|410.8456446|-33.9019784|-5.7673261|163.8526723 unknown
InChI: InChI=1S/C25H15N3O4/c29-20-12-18(14-6-1-3-8-16(14)24(20)31)26-22-10-5-11-23(28-22)27-19-13-21(30)25(32)17-9-4-2-7-15(17)19/h1-13,26-27H
charge 0 multiplicity 1
47 atoms
O  -3.843286 -3.407923 -1.287621
O  3.929083 -3.267899 1.938837
O  -1.150002 -2.574054 -1.528997
O  1.234669 -2.448921 2.216779
N  -2.391729 1.806234 0.124716
N  2.378565 1.850439 0.301631
N  -0.006287 1.841132 0.216378
C  -4.063816 0.020425 0.094479
C  4.067907 0.081932 0.367569
C  -2.655109 0.452226 -0.141487
C  2.66357 0.513446 0.626382
C  -4.466551 -1.292933 -0.302354
C  4.497972 -1.203847 0.821346
C  -1.702052 -0.432361 -0.620333
C  1.735058 -0.353259 1.179765
C  -1.181364 2.523307 0.151747
C  1.156394 2.546384 0.255465
C  -5.030623 0.854763 0.717291
C  5.002895 0.889904 -0.333549
C  -3.490701 -2.259386 -0.903646
C  3.552043 -2.145589 1.504102
C  -5.801262 -1.721857 -0.110559
C  5.830337 -1.629872 0.608122
C  -2.020979 -1.792837 -1.033461
C  2.081244 -1.687252 1.653388
C  -6.360479 0.418547 0.905169
C  6.330592 0.45664 -0.542455
C  -6.754735 -0.871261 0.482738
C  6.753527 -0.803805 -0.062974
C  -1.244851 3.946669 0.131337
C  1.194675 3.970175 0.225884
C  -0.031525 4.66143 0.166453
H  -3.216541 2.398787 0.228195
H  3.193921 2.448651 0.161075
H  -0.667232 -0.113412 -0.743899
H  0.701096 -0.038188 1.320104
H  -4.766061 1.843277 1.110768
H  4.711211 1.850988 -0.772875
H  -6.059264 -2.736211 -0.432449
H  6.110583 -2.622828 0.97496
H  -7.083002 1.082128 1.391981
H  7.028601 1.098622 -1.090192
H  -7.785351 -1.209555 0.628808
H  7.782461 -1.139788 -0.22542
H  -2.204957 4.469473 0.074774
H  2.145288 4.511554 0.26433
H  -0.041436 5.755499 0.147798
