program: Gaussian 09
title: 000276818
version: EM64L-G09RevD.01
frameworkgroup: C1[X(C16H11NO3)]
method: RPBEPBE
basis: SDD
operation: Freq
keyword: #p
keyword: freq=noraman
keyword: PBEPBE/SDD
title: #p freq=noraman PBEPBE/SDD
converged: YES YES NO NO
title: Mulliken charges:
elementType: O O O N C C C C C C C C C C C C C C C C H H H H H H H H H H H
charge: -0.142375 -0.185621 -0.429371 -0.514951 0.273074 0.399679 0.277250 -0.540019 -0.359820 -0.186099 0.524576 -0.372122 0.035582 -0.249542 -0.233304 -0.499053 -0.479705 0.318821 -0.156883 -0.420564 0.309042 0.288450 0.211845 0.293090 0.237398 0.244448 0.302136 0.234445 0.230918 0.228417 0.360261
chargesum: 0.00000
title: Mulliken charges with hydrogens summed into heavy atoms:
elementType: O O O N C C C C C C C C C C C C C C C C
charge: -0.142375 -0.185621 -0.069110 -0.205910 0.273074 0.399679 0.277250 -0.251569 -0.147975 -0.186099 0.524576 -0.079032 0.035582 -0.012144 0.011144 -0.196917 -0.245260 0.318821 0.074034 -0.192147
polarizability: 3.26720025e+02 -1.16382412e+01 2.31031005e+02 -6.92771861e+00 5.20245025e+00 9.27278291e+01
1716.lowfreq: -1.9425 -0.0007 -0.0007 -0.0004 5.7924 9.5228 33.9942 35.0829 50.8245
frequency: 33.9886 35.0565 50.8147 69.9225 111.3787 160.2446 184.0419 197.9553 222.9278 235.3817 286.3305 310.1567 346.6557 363.0675 389.4618 398.5139 422.5752 445.5832 453.2942 458.0486 507.0388 515.8206 535.1204 550.7238 581.7972 611.0446 629.3424 642.7246 678.9819 685.2822 705.3101 719.5452 750.6136 773.6101 779.3894 820.6774 835.9964 853.1048 870.7754 895.4360 919.8474 943.1304 954.8869 964.2632 974.2211 982.6874 1009.7877 1045.0939 1076.1993 1092.8977 1125.9361 1141.2733 1176.0330 1183.2888 1196.6182 1212.7383 1251.1150 1254.5344 1288.5389 1296.2931 1311.9713 1339.1337 1386.6115 1400.0015 1435.9304 1459.4785 1481.9196 1484.6619 1528.8077 1538.1226 1568.1657 1578.2933 1598.3890 1611.6668 1617.1754 1631.4820 3122.3587 3126.5235 3133.0743 3142.9574 3154.6284 3162.4595 3170.9442 3172.4437 3187.5884 3538.7119 3587.6307
redmass: 6.8894 5.8406 6.1382 7.9045 4.4319 6.5817 5.3686 4.6994 4.5437 5.9208 4.7393 6.5373 14.3929 1.1105 4.7073 4.7144 4.5633 4.0724 3.2514 6.5072 3.6295 6.2471 3.2675 2.4013 3.6276 5.0624 6.1822 3.7450 2.2889 4.9438 5.8255 3.1423 3.5336 1.6434 1.8169 2.5257 2.9184 1.5095 1.7341 1.7655 1.5896 5.3568 1.3260 3.2815 1.4643 5.7844 1.3747 2.4975 2.7523 1.6992 1.7638 1.4745 1.0925 1.1067 1.8607 2.3574 2.3590 1.8822 1.9003 1.7507 3.0976 1.9447 9.6790 6.1514 2.3453 2.5256 2.7104 3.1414 2.2463 7.4754 6.9424 7.6991 5.8475 4.9294 7.8772 6.3206 1.0874 1.0870 1.0920 1.0885 1.0935 1.0989 1.1005 1.0915 1.0925 1.0747 1.0661
irintensity: 0.1232 0.3482 0.3782 0.7033 1.4904 1.0539 2.9842 0.2480 0.2200 6.2070 13.2977 2.1152 5.0314 134.8084 2.9229 0.7684 10.7476 0.9523 26.7578 1.5245 4.3795 2.8978 25.0825 29.7380 17.0438 10.6173 4.4114 12.6999 33.8145 9.5561 8.5114 21.4135 30.3894 23.1550 98.2660 6.6735 6.7396 0.0601 35.9949 6.2091 6.0784 9.0691 1.3297 95.0844 4.6632 0.9213 1.1246 3.7060 5.8769 18.8623 44.4990 157.0646 5.0269 1.4054 8.7278 39.2848 3.2345 66.8850 69.9718 34.6893 23.6937 5.9024 6.0725 9.6311 11.3642 72.1283 29.8337 164.6650 189.5952 371.2163 37.5320 188.8975 129.2194 93.3752 6.1862 103.3628 11.6875 2.0082 18.0635 8.0492 4.4852 20.4592 24.5055 1.6271 0.3901 24.9199 52.0118
temp: 298.150 k
press: 1.00000 atm
elementType: 8 8 8 7 6 6 6 6 6 6 6 6 6 6 6 6 6 6 6 6 1 1 1 1 1 1 1 1 1 1 1
symmnumber: 1
zpe: 602189.7 jmol-1
zpe.correction: 0.229362 hartree
zpe.thermalcorrener: 0.245439 hartree
zpe.thermalcorrenthalpy: 0.246384 hartree
zpe.thermalcorrgfe: 0.184796 hartree
zpe.sumelectzpe: -895.344218 hartree
zpe.sumelectthermal: -895.328141 hartree
zpe.sumelectthermalent: -895.327196 hartree
zpe.sumelectthermalfe: -895.388785 hartree
dipole: 4.8393 -9.1127 0.2725
dipole: 10.3215
quadrupole: -87.7111 -126.1262 -118.1520
quadrupole: 19.4611 -4.1412 4.7008
quadrupole: 22.9520 -15.4631 -7.4889 19.4611 -4.1412 4.7008
hfenergy: -895.57358 hartree
pointgroup: C01 [X(C16H11N1O3)]
dipole: -1.9692967 -3.5490024 0.1289563 debye
polarizability: 327.2159864|9.5022147|229.233014|-5.851105|-14.6972685|94.0298589 unknown
InChI: InChI=1S/C16H11NO3/c18-11-5-3-4-10(8-11)17-14-9-15(19)16(20)13-7-2-1-6-12(13)14/h1-9,17-18H
charge 0 multiplicity 1
31 atoms
O  3.787448 2.23154 0.038176
O  1.238425 3.437934 0.258086
O  -4.543891 1.597421 -1.511039
N  -0.804291 -0.950921 0.289803
C  1.618276 -0.768978 -0.009393
C  0.29577 -0.101851 0.164871
C  2.805457 0.026667 -0.025486
C  0.195775 1.283488 0.222758
C  1.748959 -2.173462 -0.176494
C  2.7437 1.522813 0.060265
C  -2.194386 -0.650023 0.229809
C  4.074216 -0.58556 -0.16161
C  1.344175 2.171721 0.173163
C  3.01918 -2.776081 -0.30775
C  4.189906 -1.983555 -0.291395
C  -2.712102 0.368763 -0.605091
C  -3.079321 -1.4703 0.984873
C  -4.107377 0.572781 -0.659258
C  -4.468857 -1.254835 0.906422
C  -5.000095 -0.229976 0.093156
H  -0.595991 -1.913432 0.560377
H  -0.768886 1.771671 0.381117
H  0.868143 -2.82183 -0.246647
H  4.954343 0.065975 -0.170707
H  3.092227 -3.861514 -0.433922
H  5.174319 -2.451241 -0.393533
H  -2.069064 0.984152 -1.237602
H  -2.677952 -2.252861 1.638973
H  -5.14693 -1.883161 1.49327
H  -6.082779 -0.061289 0.045987
H  -5.529596 1.678545 -1.497676
