program: Gaussian 09
title: 000276836
version: EM64L-G09RevD.01
frameworkgroup: C1[X(C24H16O6)]
method: RPBEPBE
basis: SDD
operation: Freq
keyword: #pfreq=noraman
keyword: PBEPBE/SDD
title: #p freq=noraman PBEPBE/SDD
converged: YES YES NO NO
title: Mulliken charges:
elementType: O O O O O O C C C C C C C C C C C C C C C C C C C C C C C C H H H H H H H H H H H H H H H H
charge: -0.394447 -0.400191 -0.172311 -0.164338 -0.132415 -0.136476 -0.378392 0.209574 0.194476 0.007713 0.061821 0.397196 0.389366 -0.115477 -0.074398 -0.127750 0.274570 0.280683 -0.215282 -0.226310 -0.384848 -0.401761 -0.371836 -0.370251 -0.207793 -0.247211 -0.240514 -0.234979 -0.237175 -0.746185 0.281849 0.268501 0.209147 0.221260 0.295353 0.293254 0.216212 0.240829 0.239598 0.245942 0.244881 0.370722 0.370863 0.225997 0.219492 0.221042
chargesum: 0.00000
title: Mulliken charges with hydrogens summed into heavy atoms:
elementType: O O O O O O C C C C C C C C C C C C C C C C C C C C C C C C
charge: -0.023725 -0.029328 -0.172311 -0.164338 -0.132415 -0.136476 -0.096543 0.209574 0.194476 0.007713 0.061821 0.397196 0.389366 0.153024 -0.074398 -0.127750 0.274570 0.280683 -0.215282 -0.226310 -0.175701 -0.180501 -0.076483 -0.076997 0.008419 -0.006382 -0.000917 0.010963 0.007706 -0.079654
polarizability: 4.05098408e+02 -1.44555797e+01 2.53631566e+02 -7.00165024e+01 2.44710610e+00 2.50389349e+02
1716.lowfreq: -6.4603 -2.8705 -0.0008 0.0005 0.0006 6.2838 17.3126 17.6447 27.4000
frequency: 17.2621 17.5056 27.3997 33.1273 52.3079 55.5238 62.3252 91.0199 96.4799 113.4132 117.3714 133.6271 148.4116 179.6938 181.4284 196.1067 222.4520 227.2868 236.3587 262.3630 273.1741 295.9097 308.0600 313.7244 349.3713 358.9385 361.7853 368.1419 369.5072 395.8407 400.9127 407.4041 419.8129 438.6143 446.6356 460.7320 470.0582 499.1239 504.6179 521.4345 563.0674 569.7608 620.1214 631.7647 646.6427 656.1324 668.0147 682.5702 688.9962 711.3920 720.5742 732.0980 774.9984 777.3014 803.6438 833.9436 844.0630 852.9150 854.6041 900.9150 902.5258 912.3224 928.8174 947.4538 969.1045 973.7566 975.0422 980.3468 1001.3520 1007.3123 1007.8973 1040.5158 1042.6542 1043.8906 1076.8906 1080.9565 1101.4867 1123.9617 1124.5662 1138.9227 1169.9432 1179.2819 1185.7106 1207.1182 1215.0790 1220.3091 1239.2229 1261.8088 1275.7222 1280.8012 1283.0590 1291.7436 1304.5350 1312.9838 1343.7442 1359.5327 1391.1936 1391.4369 1393.0542 1436.4857 1438.6568 1461.6498 1469.6434 1479.6354 1481.2120 1523.0209 1535.0632 1570.8781 1572.8129 1580.2684 1584.4196 1611.2009 1613.2834 1616.4812 1627.1620 1679.4912 2962.9151 3021.4671 3036.0477 3068.1425 3088.5353 3114.2210 3124.5140 3144.3903 3144.7614 3148.9494 3155.6233 3156.6848 3172.3039 3173.0013 3554.6062 3571.7653
redmass: 6.3947 6.6320 7.5371 3.8734 4.3920 10.6614 7.5304 5.1943 6.2649 4.0906 3.3119 1.3031 5.9128 5.6738 4.8992 1.7177 5.2976 1.8644 3.5757 3.3667 4.4765 2.0115 2.7481 4.7277 5.8429 9.0586 4.7204 13.2792 5.7854 8.0510 7.9004 4.3191 5.4496 4.4749 4.3919 6.8148 8.1606 6.8089 3.7117 7.0651 5.3122 5.2053 5.7411 5.4156 6.2814 5.9850 4.5975 5.5002 5.0995 4.5379 3.5856 4.9186 1.4852 1.4539 1.8465 5.4254 5.7843 2.4082 2.4332 2.5050 2.3146 5.2770 1.8220 3.7805 5.1824 1.4236 1.4402 1.1457 6.9217 1.3806 1.3851 2.4740 2.2152 1.5431 3.4831 3.2730 2.6586 1.9430 1.9655 3.2354 1.2909 1.1061 1.1653 1.6528 2.2418 2.5217 1.6330 3.0090 3.4356 1.9410 1.6909 1.3385 2.5202 2.0879 2.6338 1.6036 2.0650 2.7016 6.4350 2.3460 2.3759 1.0480 1.0583 2.6108 2.5900 12.5542 12.3106 8.1852 8.8311 7.4146 6.9681 7.1354 7.8149 8.5196 7.6517 6.1654 1.0365 1.0816 1.0970 1.0930 1.0964 1.0887 1.0876 1.0884 1.0880 1.0908 1.0936 1.0933 1.1006 1.1005 1.0654 1.0657
irintensity: 10.7916 5.4554 0.5817 0.1383 0.7335 4.9742 1.6189 5.7608 2.6762 4.2207 8.0832 2.8008 4.0464 2.3168 1.5350 0.6076 1.9408 190.5833 13.0620 32.6240 6.0278 17.6677 137.2750 17.3893 0.4004 1.2541 12.7966 1.6043 1.4773 1.2697 5.6135 3.4719 0.6477 16.6984 18.8199 3.2473 0.7683 13.2862 4.7172 1.2148 2.8814 4.4852 3.6215 3.0154 0.0516 21.9088 32.7411 20.7713 5.3353 7.1648 4.8727 1.8021 66.8835 62.4117 6.8542 21.8237 24.0077 4.0766 1.0819 1.2495 4.8875 6.6523 17.2030 49.3786 2.5716 1.6694 1.7327 56.0804 9.9291 0.5604 0.9009 12.2723 10.7062 0.0683 20.6997 50.2218 5.8722 89.1660 24.6140 4.3454 84.3979 6.1535 24.2231 83.1593 14.9749 21.3337 58.5586 4.7659 35.3732 33.4318 29.5801 7.8507 33.7209 103.1257 77.1076 19.3187 5.2810 4.3046 1.9010 12.4187 11.8279 13.4929 13.6394 19.6989 33.7938 86.0309 383.7776 7.8503 22.0265 77.6348 36.8308 8.1908 13.6742 44.4769 17.9158 3.8753 51.7586 6.1968 26.8060 3.4363 38.1714 11.8664 7.3404 5.3960 4.9831 10.4717 5.2928 4.3831 27.6994 23.4311 39.1955 40.2092
temp: 298.150 k
press: 1.00000 atm
elementType: 8 8 8 8 8 8 6 6 6 6 6 6 6 6 6 6 6 6 6 6 6 6 6 6 6 6 6 6 6 6 1 1 1 1 1 1 1 1 1 1 1 1 1 1 1 1
symmnumber: 1
zpe: 876708.0 jmol-1
zpe.correction: 0.333920 hartree
zpe.thermalcorrener: 0.360306 hartree
zpe.thermalcorrenthalpy: 0.361250 hartree
zpe.thermalcorrgfe: 0.275217 hartree
zpe.sumelectzpe: -1373.375602 hartree
zpe.sumelectthermal: -1373.349216 hartree
zpe.sumelectthermalent: -1373.348272 hartree
zpe.sumelectthermalfe: -1373.434305 hartree
dipole: 1.0567 1.7617 0.2265
dipole: 2.0668
quadrupole: -106.4412 -172.3222 -182.4336
quadrupole: -5.1962 -26.3348 -2.9626
quadrupole: 47.2911 -18.5898 -28.7013 -5.1962 -26.3348 -2.9626
hfenergy: -1373.709522 hartree
pointgroup: C01 [X(C24H16O6)]
dipole: -0.4027053 -0.3750965 0.5985946 debye
polarizability: 407.6932643|44.2426494|249.1907268|52.467499|-2.2431264|252.2353319 unknown
InChI: InChI=1S/C24H16O6/c1-2-7-16(17-19(25)12-8-3-5-10-14(12)21(27)23(17)29)18-20(26)13-9-4-6-11-15(13)22(28)24(18)30/h2-11,16,25-26H,1H3
charge 0 multiplicity 1
46 atoms
O  -2.502178 -2.122878 -0.249498
O  2.181337 0.020702 2.345579
O  -0.251265 1.627326 1.664884
O  0.22241 -1.240055 -1.843326
O  -2.378119 3.2949 0.967903
O  2.404142 -0.169837 -3.211364
C  -0.129513 -1.214647 0.933771
C  -1.321305 -0.281321 0.663015
C  1.146435 -0.646311 0.296011
C  -2.471298 -0.767056 0.05896
C  2.20992 -0.054667 0.95858
C  -3.668303 0.055074 -0.229905
C  3.415559 0.475015 0.271896
C  -0.086694 -1.584039 2.411885
C  -1.252847 1.128248 1.062357
C  1.175113 -0.725638 -1.176134
C  -3.642998 1.452453 0.059187
C  3.485247 0.473532 -1.152787
C  -2.44351 2.062979 0.704359
C  2.380136 -0.127967 -1.95051
C  -4.848876 -0.501242 -0.78556
C  4.520423 0.984539 1.001604
C  -4.761227 2.26454 -0.236711
C  4.61301 1.007296 -1.817457
C  -0.210632 -2.864246 2.846148
C  -5.961158 0.317301 -1.083763
C  5.642425 1.521829 0.331695
C  -5.919371 1.704965 -0.815978
C  5.690133 1.542747 -1.081271
C  -0.207805 -3.288049 4.297661
H  -0.349082 -2.137657 0.365951
H  0.024329 -0.761808 3.126444
H  -4.938113 -1.577941 -0.976096
H  4.54138 0.944451 2.096817
H  -4.698175 3.33113 0.00212
H  4.621969 0.983782 -2.912063
H  -0.31623 -3.669193 2.101348
H  -6.861614 -0.130925 -1.516421
H  6.482673 1.913827 0.914356
H  -6.782666 2.336585 -1.047707
H  6.56073 1.959655 -1.59726
H  -3.146852 -2.334533 -0.96943
H  2.648023 0.827727 2.679677
H  -0.09852 -2.419415 4.970646
H  -1.14552 -3.814748 4.563548
H  0.622772 -3.990733 4.506534
