program: Gaussian 09
title: 000276819
version: EM64L-G09RevD.01
frameworkgroup: C1[X(C16H23NO4)]
method: RPBEPBE
basis: SDD
operation: Freq
keyword: #p
keyword: freq=noraman
keyword: PBEPBE/SDD
title: #p freq=noraman PBEPBE/SDD
converged: YES YES NO NO
title: Mulliken charges:
elementType: O O O O N C C C C C C C C C C C C C C C C H H H H H H H H H H H H H H H H H H H H H H H
charge: -0.441259 -0.265255 -0.238683 -0.293673 -0.371934 -0.191242 -0.227601 0.358766 -0.234349 0.552712 -0.424449 -0.365302 -0.443572 -0.472774 0.225440 -0.692622 -0.693312 0.269644 -0.253553 -0.789245 -0.661186 0.270953 0.282928 0.206334 0.287933 0.264806 0.235007 0.232600 0.323845 0.226992 0.211243 0.213333 0.214800 0.211778 0.225142 0.340591 0.238176 0.226310 0.262254 0.239841 0.238315 0.218950 0.250646 0.230673
chargesum: 0.00000
title: Mulliken charges with hydrogens summed into heavy atoms:
elementType: O O O O N C C C C C C C C C C C C C C C C
charge: -0.100668 -0.265255 -0.238683 -0.293673 -0.048090 0.079711 0.055327 0.358766 -0.028014 0.552712 -0.136516 -0.100496 -0.208565 -0.240175 0.225440 -0.041054 -0.041592 0.269644 0.210933 -0.048834 0.039082
polarizability: 2.46889960e+02 5.96244766e+00 1.76031538e+02 -9.03562241e+00 -9.04041651e+00 1.59309675e+02
1716.lowfreq: -78.0016 -18.5121 -5.5049 -1.5795 -0.0006 -0.0006 -0.0003 7.9349 17.5057
frequency: -77.9931 -11.5344 17.1896 39.0395 41.7947 48.3141 70.0066 76.0638 79.1042 86.6874 108.0714 115.2724 148.1524 169.3059 202.5813 205.3473 209.5795 231.4344 240.5367 251.8913 270.9713 294.9239 314.4434 330.0387 339.0995 351.5365 408.1054 416.3379 429.4934 465.6705 479.9263 534.2272 559.3647 584.7962 585.4915 602.5266 621.0123 636.0392 677.2514 714.0733 745.9419 758.4395 791.7377 813.6385 818.0428 854.4585 864.1687 876.5804 890.3912 912.0253 918.3268 951.4565 961.8833 970.8509 978.2101 988.6377 1001.6981 1013.1635 1014.4403 1036.7885 1053.3274 1096.3982 1110.8299 1116.5809 1135.1369 1156.7583 1157.6375 1164.3930 1186.3356 1202.7459 1219.8509 1224.1365 1252.4790 1274.1380 1277.2727 1284.3447 1302.3588 1307.9814 1320.2306 1342.7653 1354.5188 1356.9082 1377.0382 1377.9947 1383.6406 1392.1446 1396.8428 1412.9153 1445.0381 1456.9400 1463.0403 1465.6070 1466.4023 1467.5540 1478.5048 1484.3088 1484.9694 1486.2454 1509.3665 1577.6141 1620.2635 1622.5425 1637.8177 2973.9402 2976.5786 2978.7569 2992.6662 2994.2805 3033.7158 3035.7177 3041.0013 3067.2607 3074.0293 3076.8516 3078.8900 3081.5509 3089.6183 3096.4056 3114.9058 3119.6174 3122.8430 3136.6718 3137.5616 3144.9783 3519.4609 3539.2008
redmass: 1.0367 2.9144 4.3210 3.1545 3.9958 3.7595 4.1726 3.6665 6.4753 5.0154 4.3524 3.7810 5.2765 3.1325 1.4708 2.3110 1.1803 3.1262 4.9478 1.2523 2.2302 1.8504 3.0493 2.6920 2.7814 3.1126 2.8886 3.3491 4.6238 3.3342 3.4830 3.3927 3.4812 3.3639 2.5520 2.6330 2.1946 5.8718 3.7007 3.0264 4.3774 3.8054 2.1214 3.1762 1.8813 1.4541 1.5018 3.9046 2.5600 4.2046 1.1842 1.4586 2.3567 1.3862 2.8784 1.3937 2.4237 2.8572 2.8728 1.6821 1.5539 2.1662 2.5669 1.7319 3.6736 1.6896 1.7077 2.9142 1.7028 1.1940 1.5614 1.8142 1.7170 1.4614 1.1251 1.7901 1.8259 1.3181 1.7243 1.3955 1.2615 1.2428 1.1977 1.2551 3.4712 1.2322 1.2186 2.5363 1.1913 1.0953 1.0437 1.0444 1.0516 1.0511 1.0475 1.0647 1.1149 1.5729 2.3200 6.1680 6.1638 6.1776 8.9788 1.0349 1.0398 1.0792 1.0380 1.0362 1.0605 1.0817 1.0838 1.1001 1.0993 1.1004 1.0981 1.0996 1.0972 1.1032 1.0879 1.0882 1.1067 1.0986 1.0961 1.0960 1.0766 1.0657
irintensity: 0.0643 0.1604 0.5325 0.1559 1.6983 3.8552 0.3154 2.6415 2.2802 29.1295 1.1471 4.0790 4.9835 1.0919 4.4144 3.2630 0.0739 3.5495 2.3964 1.8207 18.7337 95.4204 12.1062 64.0086 33.2036 18.2125 1.7493 8.6555 6.3455 12.8065 12.5011 16.6724 13.2759 9.8811 46.4076 13.5595 17.4299 1.5147 14.7721 53.5594 1.1725 27.4724 7.8960 28.7926 6.8241 11.5501 18.8655 27.0651 1.6328 20.8041 4.0684 0.0489 5.6413 0.2137 20.8934 0.4824 53.8137 58.3755 25.1405 6.5631 25.0663 25.7187 1.3767 4.3031 155.1775 1.0038 4.4566 149.7222 13.2927 11.2167 33.3878 13.2474 11.5515 83.3155 4.7682 95.5569 6.6178 1.0001 42.5654 9.1621 8.7974 60.1266 13.2203 57.5037 3.1996 24.5339 9.4189 10.5832 94.3954 13.6383 13.7990 2.2676 23.2953 3.5061 16.5602 9.1427 12.2304 154.8916 26.9259 4.6405 145.8202 48.8015 117.2632 31.8735 36.6361 20.9823 7.3467 18.5647 32.5681 2.3958 15.1111 0.4119 106.7534 25.6384 12.5087 38.7966 33.5203 1.1594 16.7030 12.5457 27.9364 8.4431 13.5822 12.5311 35.0308 5.9083
temp: 298.150 k
press: 1.00000 atm
elementType: 8 8 8 8 7 6 6 6 6 6 6 6 6 6 6 6 6 6 6 6 6 1 1 1 1 1 1 1 1 1 1 1 1 1 1 1 1 1 1 1 1 1 1 1
symmnumber: 1
zpe: 953704.9 jmol-1
zpe.correction: 0.363247 hartree
zpe.thermalcorrener: 0.385228 hartree
zpe.thermalcorrenthalpy: 0.386173 hartree
zpe.thermalcorrgfe: 0.310518 hartree
zpe.sumelectzpe: -977.561485 hartree
zpe.sumelectthermal: -977.539503 hartree
zpe.sumelectthermalent: -977.538559 hartree
zpe.sumelectthermalfe: -977.614213 hartree
dipole: -0.0121 -0.5600 1.1780
dipole: 1.3044
quadrupole: -110.0256 -120.0429 -128.1831
quadrupole: 4.5724 6.1214 9.0195
quadrupole: 9.3916 -0.6257 -8.7659 4.5724 6.1214 9.0195
hfenergy: -977.9247317 hartree
pointgroup: C01[X(C16H23N1O4)]
dipole: -0.0328557 -0.373981 0.3498735 debye
polarizability: 247.8555926|3.9875754|179.0287693|-5.9454341|-0.4167361|155.3468108 unknown
InChI: InChI=1S/C16H23NO4/c1-5-21-16(20)14(17-11(4)18)15(19)13-8-6-12(7-9-13)10(2)3/h6-10,14-15,17,19H,5H2,1-4H3
charge 0 multiplicity 1
44 atoms
O  -1.177131 -1.566663 1.651144
O  -3.41272 -0.897229 -1.031489
O  -4.000582 0.351466 0.851846
O  -0.48558 2.869834 -0.329519
N  -1.437455 1.307102 1.112472
C  -0.823161 -1.017943 0.320437
C  -1.645158 0.290567 0.080467
C  0.692571 -0.897666 0.159491
C  5.068148 -0.857055 -0.335806
C  3.547149 -0.866764 -0.161215
C  1.33854 0.195604 -0.471101
C  1.491791 -1.973731 0.628468
C  2.741754 0.204395 -0.625451
C  2.893542 -1.955243 0.470306
C  -3.142671 -0.055863 0.035941
C  5.469516 -0.830276 -1.835056
C  5.724792 0.322384 0.430949
C  -0.947611 2.575376 0.815554
C  -4.835438 -1.342828 -1.197793
C  -0.998368 3.566275 1.973579
C  -5.627358 -0.318266 -2.013198
H  -1.217395 -1.776055 -0.37969
H  -1.359641 0.730492 -0.892911
H  5.459585 -1.799078 0.099464
H  0.764842 1.057036 -0.830903
H  1.004148 -2.82892 1.110291
H  3.209894 1.066904 -1.114702
H  3.489754 -2.800197 0.837625
H  -1.976826 1.179827 1.973725
H  5.032488 -1.685584 -2.381112
H  6.569365 -0.873179 -1.943426
H  5.11769 0.097557 -2.323123
H  5.37638 1.294975 0.036391
H  6.825306 0.289283 0.325039
H  5.477827 0.28672 1.507342
H  -0.614324 -1.105256 2.325711
H  -5.271273 -1.489098 -0.194277
H  -4.741325 -2.308698 -1.718593
H  -0.569679 4.522947 1.642705
H  -2.039879 3.735493 2.303953
H  -0.421165 3.194367 2.839524
H  -6.647989 -0.70152 -2.198552
H  -5.71259 0.636582 -1.468188
H  -5.145964 -0.132971 -2.988723
