program: Gaussian 09
title: 000276816
version: EM64L-G09RevD.01
frameworkgroup: C1[X(C15H17NO5)]
method: RPBEPBE
basis: SDD
operation: Freq
keyword: #p
keyword: freq=noraman
keyword: PBEPBE/SDD
title: #p freq=noraman PBEPBE/SDD
converged: YES YES NO NO
title: Mulliken charges:
elementType: O O O O O N C C C C C C C C C C C C C C C H H H H H H H H H H H H H H H H H
charge: -0.286296 -0.254576 -0.237709 -0.426340 -0.228057 -0.454324 -0.351368 -0.347489 -0.294081 -0.688368 0.236153 0.177880 0.511677 -0.352238 -0.320462 -0.341654 -0.443861 0.191779 -0.249681 -0.273507 0.178483 0.229656 0.202488 0.203646 0.192084 0.228913 0.218347 0.218358 0.210385 0.216432 0.272912 0.273244 0.311994 0.224227 0.322080 0.285454 0.257165 0.386653
chargesum: 0.00000
title: Mulliken charges with hydrogens summed into heavy atoms:
elementType: O O O O O N C C C C C C C C C C C C C C C
charge: -0.286296 -0.254576 -0.237709 -0.039687 -0.228057 -0.132243 0.080777 0.048240 0.153179 -0.043194 0.236153 0.177880 0.511677 -0.079326 -0.047218 -0.029659 -0.219634 0.191779 0.035773 -0.016342 0.178483
polarizability: 3.73878212e+02 8.89348236e+00 1.80725271e+02 -1.56703801e+01 8.38093088e+00 1.06663825e+02
1716.lowfreq: -20.1400 -0.5665 -0.0010 0.0005 0.0007 2.4941 13.6544 18.1044 35.0738
frequency: 2.0289 17.5344 35.0563 38.5911 45.5347 56.3685 63.3397 83.0299 101.6482 112.0487 122.1019 152.0189 156.3607 169.1220 191.3795 208.7284 230.4707 277.4488 313.0239 314.6571 330.2960 385.5607 396.0686 413.6600 423.5652 482.1366 503.4849 519.4504 549.0085 582.0894 610.2617 630.8136 643.9662 658.4962 678.6486 695.6495 728.4366 742.7552 755.5859 760.7743 808.7401 840.3222 841.2784 887.7250 892.2841 895.4629 910.7224 924.7476 939.7177 957.7881 976.7523 996.9958 1004.8920 1013.4730 1029.1387 1054.5562 1058.7131 1073.7420 1115.3972 1126.2011 1164.4324 1186.0710 1214.8490 1225.9822 1226.8841 1249.6698 1263.4612 1264.5560 1270.9589 1289.0341 1290.1841 1307.7638 1328.4925 1345.1965 1368.4788 1373.1684 1389.6728 1419.9574 1451.0815 1470.5769 1476.9740 1477.3105 1488.3890 1491.0374 1507.4496 1577.8347 1590.5887 1620.0141 1621.5771 1639.8321 1651.1948 2968.1387 2975.9063 2992.0221 3013.7699 3020.7230 3052.3246 3073.5907 3076.1795 3099.6287 3117.8014 3144.1188 3150.6950 3159.4365 3181.5372 3200.9924 3520.8022 3524.6033
redmass: 4.0223 5.0395 5.8915 5.7961 3.5240 3.0748 4.1639 5.3532 2.9084 5.1620 4.0411 4.7226 3.2663 6.1855 4.9385 3.8040 1.1723 3.7703 6.3332 5.3640 6.0910 6.5148 3.7619 2.9910 4.3119 4.5278 5.1853 3.3152 3.5542 1.9158 5.0751 6.1503 1.5590 1.5396 4.1564 4.9901 7.5289 1.1132 3.1130 4.5073 1.3876 1.5291 4.2513 1.4998 2.2412 2.3082 3.7779 6.7052 1.2016 4.2112 1.3673 1.1249 3.4750 1.3318 3.5859 2.1568 4.2382 2.4315 2.4761 1.3556 1.7490 1.1630 2.4288 1.5830 1.3235 2.6498 1.5944 2.0078 1.3080 1.1520 1.0767 1.3811 2.1016 1.4511 1.4468 4.3070 1.2140 4.5510 1.1021 1.0675 1.0532 1.0531 1.0886 2.1360 2.8238 9.4794 3.9302 9.1434 6.4441 8.4559 6.2878 1.0588 1.0363 1.0600 1.0994 1.0574 1.1029 1.1010 1.0996 1.1085 1.0905 1.0977 1.0866 1.0912 1.0943 1.0951 1.0762 1.0642
irintensity: 0.5380 0.1684 1.0354 0.2571 0.5744 0.4221 0.4944 3.0296 0.3206 2.2060 0.0270 2.0706 6.2806 0.4026 0.1743 3.1325 0.6510 2.6257 14.9508 15.8753 3.0176 11.6071 3.4168 0.1802 10.5105 18.3070 9.2318 10.2568 59.9602 59.1050 6.7397 6.1920 115.5369 8.8529 36.8757 11.3584 31.9406 13.1994 6.4043 18.5544 1.5464 27.2379 10.9824 47.8175 8.3546 21.3458 10.3406 11.4650 0.3763 21.9420 0.0348 58.3056 73.5945 0.5526 6.5164 384.4845 371.1429 5.2671 12.7631 19.2737 42.9611 127.7490 91.0667 1.9256 8.1652 291.3453 118.1639 32.2195 39.1635 4.6499 1.3901 22.8364 129.0130 6.7936 11.1828 227.9240 10.4780 36.2957 24.1310 0.4522 9.2053 7.5286 17.2161 111.4540 213.4062 169.1222 112.8759 217.3160 52.1396 292.8932 46.9037 34.1740 33.7814 20.7342 8.8332 57.2644 6.1323 61.5709 55.4460 33.4990 15.7778 7.9716 3.0078 1.2219 1.4937 3.6789 9.9418 61.6227
temp: 298.150 k
press: 1.00000 atm
elementType: 8 8 8 8 8 7 6 6 6 6 6 6 6 6 6 6 6 6 6 6 6 1 1 1 1 1 1 1 1 1 1 1 1 1 1 1 1 1
symmnumber: 1
zpe: 777840.6 jmol-1
zpe.correction: 0.296264 hartree
zpe.thermalcorrener: 0.317793 hartree
zpe.thermalcorrenthalpy: 0.318737 hartree
zpe.thermalcorrgfe: 0.239404 hartree
zpe.sumelectzpe: -1011.134839 hartree
zpe.sumelectthermal: -1011.113310 hartree
zpe.sumelectthermalent: -1011.112366 hartree
zpe.sumelectthermalfe: -1011.191699 hartree
dipole: 0.5414 -5.9270 -0.1338
dipole: 5.9532
quadrupole: -113.0765 -126.1354 -126.3908
quadrupole: 11.6358 6.5732 0.3202
quadrupole: 8.7911 -4.2679 -4.5233 11.6358 6.5732 0.3202
hfenergy: -1011.4311031 hartree
pointgroup: C01 [X(C15H17N1O5)]
dipole: 0.2473923 0.9825199 2.1116918 debye
polarizability: 373.948781|-16.1288367|114.2524107|-4.9738447|24.5006181|173.0661171 unknown
InChI: InChI=1S/C15H17NO5/c1-2-3-10-21-15(20)11-4-6-12(7-5-11)16-13(17)8-9-14(18)19/h4-9,16,18H,2-3,10H2,1H3
charge 0 multiplicity 1
38 atoms
O  3.897639 -0.166948 0.764218
O  3.849204 -1.309697 -1.274068
O  -3.186673 -0.664798 -2.317462
O  -7.007689 0.502802 2.088368
O  -7.612385 0.843911 -0.137955
N  -2.420013 0.239634 -0.27671
C  6.092807 0.802237 0.0739
C  7.63118 0.679659 0.187398
C  5.380132 -0.340601 0.809569
C  8.365208 1.824515 -0.543557
C  1.779879 -0.441972 -0.318471
C  3.246816 -0.693965 -0.358043
C  -1.024001 -0.012162 -0.339435
C  0.980481 -0.931467 -1.382855
C  1.161018 0.27037 0.742311
C  -0.410394 -0.726207 -1.406456
C  -0.226203 0.482699 0.731297
C  -3.409408 -0.096108 -1.205167
C  -4.809305 0.259143 -0.811083
C  -5.305939 0.259353 0.458728
C  -6.736081 0.562742 0.712137
H  5.796779 0.787326 -0.991946
H  5.763377 1.771471 0.496419
H  7.955015 -0.293886 -0.232767
H  7.925308 0.674982 1.257001
H  5.6355 -1.318442 0.362671
H  5.612248 -0.340334 1.887819
H  9.46176 1.724604 -0.448121
H  8.077042 2.808985 -0.129514
H  8.117924 1.827741 -1.621403
H  1.47214 -1.477463 -2.194597
H  1.775793 0.64814 1.563175
H  -1.023283 -1.099344 -2.227988
H  -0.698337 1.033835 1.554833
H  -2.733323 0.773362 0.538283
H  -5.487373 0.445186 -1.653202
H  -4.706497 0.007499 1.340994
H  -7.969144 0.707599 2.244777
