program: Gaussian 09
title: 000276832
version: EM64L-G09RevD.01
frameworkgroup: C1[X(C22H14Br2N2O4)]
method: RPBEPBE
basis: SDD
operation: Freq
keyword: #p
keyword: freq=noraman
keyword: PBEPBE/SDD
title: #p freq=noraman PBEPBE/SDD
converged: YES YES NO NO
title: Mulliken charges:
elementType: Br Br O O O O N N C C C C C C C C C C C C C C C C C C C C C C H H H H H H H H H H H H H H
charge: 0.017089 0.017105 -0.190181 -0.190204 -0.220068 -0.220073 0.023797 0.023820 0.452719 0.452996 -0.591580 0.216931 0.216883 -0.611438 -0.350680 -0.350799 -0.257654 -0.257559 0.583883 0.583909 -0.414763 -0.414772 -0.376467 -0.376481 -0.192718 -0.192725 -0.242166 -0.242158 -0.233016 -0.233020 0.235826 0.329603 0.289689 0.289716 0.223664 0.223600 0.249085 0.249082 0.254841 0.254842 0.240909 0.240910 0.243809 0.243813
chargesum: 0.00000
title: Mulliken charges with hydrogens summed into heavy atoms:
elementType: Br Br O O O O N N C C C C C C C C C C C C C C C C C C C C C C
charge: 0.017089 0.017105 -0.190181 -0.190204 -0.220068 -0.220073 0.023797 0.023820 0.452719 0.452996 -0.355753 0.216931 0.216883 -0.281834 -0.060990 -0.061083 -0.033990 -0.033960 0.583883 0.583909 -0.414763 -0.414772 -0.127382 -0.127399 0.062123 0.062117 -0.001257 -0.001248 0.010793 0.010792
polarizability: 6.27538353e+02 2.32596219e-02 5.25520562e+02 -3.42615284e+01 1.44527800e-02 1.21504621e+02
1716.lowfreq: -4.5004 -3.4673 -2.3992 -0.0007 -0.0006 -0.0005 8.0061 9.2249 19.4074
frequency: 7.9451 9.1011 19.4066 23.3253 31.8066 35.3272 39.2882 50.1191 61.2360 62.0374 81.5810 114.0376 116.0634 129.0633 139.7468 152.8526 153.5292 176.9816 199.1341 216.9271 258.6452 283.4484 290.1059 292.6636 293.7370 308.7346 335.5647 350.5727 381.7116 383.6507 431.6232 442.6554 456.0290 476.7071 491.0521 497.9809 518.4460 522.2919 577.8636 584.5053 616.0724 622.5708 626.6790 642.5201 659.7078 683.9469 687.2450 711.4515 715.9879 734.8227 735.5668 757.7274 765.9611 766.2198 774.5010 818.2890 856.5304 857.6423 868.3031 868.7220 890.5475 904.3899 915.9054 957.3557 957.4362 963.1414 990.6087 991.2469 997.2853 999.5329 1003.3723 1004.3595 1035.3299 1043.4653 1043.9481 1087.0312 1116.7910 1117.4892 1166.4234 1176.5257 1176.5614 1182.3521 1194.3833 1195.0264 1232.5011 1233.6556 1277.4628 1286.1000 1286.6176 1293.6262 1302.7772 1316.0275 1318.6728 1349.7507 1368.6436 1373.6881 1375.5638 1400.2482 1413.1190 1425.1168 1425.9788 1449.2283 1455.8062 1473.9620 1534.2781 1558.0877 1559.0540 1586.0903 1593.9635 1599.5286 1621.1496 1627.6428 3125.0443 3125.2197 3141.6216 3141.6401 3152.9047 3152.9144 3166.7322 3166.7455 3178.3136 3179.2174 3179.2603 3187.3144 3187.3443 3191.1867
redmass: 8.2278 18.5009 12.2685 11.2506 10.2574 9.5000 15.9460 7.2067 3.0952 3.4165 4.9087 6.9211 6.1040 4.1362 5.0747 7.0178 5.9161 7.3074 10.2808 3.7788 3.8001 6.6729 6.6115 11.4768 6.0896 6.7093 9.9714 8.3394 9.3143 9.5735 3.0111 3.2450 3.5069 5.3641 5.2722 5.7964 4.7976 3.5791 6.5317 7.3348 6.8735 5.6364 6.7883 7.2294 7.1986 8.5426 7.1267 3.6007 4.6947 4.4568 2.7112 12.3750 1.3961 1.3723 5.7361 7.1010 4.3397 3.7890 1.3779 1.4347 1.7423 2.2768 2.1325 1.3835 1.3878 1.4479 1.2956 1.3260 6.8091 2.9365 1.5332 1.1797 3.0519 2.1365 2.1589 8.0950 1.8634 1.8176 1.9039 1.1143 1.0727 8.0550 5.0175 5.9345 1.5418 1.6827 1.3493 1.9556 1.6868 1.5323 3.1849 1.5506 1.5092 5.2758 4.2497 6.3670 5.2686 4.4774 3.9994 2.2614 2.2852 2.4767 2.5210 3.0772 9.1496 5.3436 5.3423 5.1983 6.2571 6.1520 5.0482 5.5656 1.0899 1.0894 1.0858 1.0858 1.0904 1.0904 1.0954 1.0954 1.0890 1.1000 1.0999 1.0880 1.0880 1.0909
irintensity: 2.2551 0.0052 0.3430 0.0070 0.0314 0.9954 0.2767 0.6263 1.7560 6.2720 0.3953 0.9647 1.4740 0.6134 0.0171 0.5670 6.6515 0.7812 2.0588 1.2527 1.1912 0.5422 6.0638 2.2741 0.1790 0.1285 0.1059 0.2301 2.4885 0.2308 2.5329 2.6342 19.8792 2.7787 8.7369 11.1805 7.2867 1.3043 6.3724 9.3490 0.0487 7.3662 0.3031 9.3508 27.2269 2.3485 20.4667 4.9561 0.1200 0.0632 10.2015 25.4392 3.1657 154.0508 5.9071 6.3616 2.5098 26.9834 0.4432 0.3422 0.9793 0.0494 2.8209 0.0783 0.1223 29.7611 0.0715 21.9629 21.1264 54.8441 18.2513 94.7536 13.3742 0.7937 9.4734 4.6805 13.4077 5.5088 46.5417 30.4722 9.2067 409.8554 591.7912 147.7985 6.3555 0.0934 9.4349 19.1952 54.6462 11.3973 102.6061 1.8825 76.1359 54.1500 154.3680 37.5002 9.8604 74.1691 7.9905 62.0007 14.9678 2.8504 0.4411 48.8543 165.2317 19.5016 0.6338 551.2652 15.9967 102.9404 253.2570 8.2011 2.8790 18.6759 2.6314 0.1151 5.0022 4.9768 12.3187 9.5078 1.4072 35.1708 5.9815 27.0834 24.9971 25.8327
temp: 298.150 k
press: 1.00000 atm
elementType: 35 35 8 8 8 8 7 7 6 6 6 6 6 6 6 6 6 6 6 6 6 6 6 6 6 6 6 6 6 6 1 1 1 1 1 1 1 1 1 1 1 1 1 1
symmnumber: 1
zpe: 800853.6 jmol-1
zpe.correction: 0.305029 hartree
zpe.thermalcorrener: 0.332370 hartree
zpe.thermalcorrenthalpy: 0.333314 hartree
zpe.thermalcorrgfe: 0.239080 hartree
zpe.sumelectzpe: -1281.798718 hartree
zpe.sumelectthermal: -1281.771378 hartree
zpe.sumelectthermalent: -1281.770433 hartree
zpe.sumelectthermalfe: -1281.864667 hartree
dipole: -0.0017 -7.4233 -0.0055
dipole: 7.4233
quadrupole: -152.8901 -228.4762 -197.6294
quadrupole: -0.0039 -3.0780 -0.0073
quadrupole: 40.1085 -35.4776 -4.6308 -0.0039 -3.0780 -0.0073
hfenergy: -1282.1037471 hartree
pointgroup: C01 [X(C22H14Br2N2O4)]
dipole: 0.0007824 -2.9205416 -0.0028246 debye
polarizability: 628.2561262|0.031125|525.5194256|-28.4626108|0.6777126|120.7879848 unknown
InChI: InChI=1S/C22H14Br2N2O4/c23-19-7-3-1-5-15(19)9-11-17-13-18(12-10-16-6-2-4-8-20(16)24)22(26(29)30)14-21(17)25(27)28/h1-14H
charge 0 multiplicity 1
44 atoms
Br -2.115011 -3.826912 -0.670636
Br 2.114528 -3.829604 0.655385
O  2.294401 5.016104 0.192833
O  -2.295418 5.016549 -0.176633
O  3.537281 3.286985 -0.598663
O  -3.538315 3.2847 0.608787
N  2.420568 3.781494 -0.166139
N  -2.421505 3.780762 0.178304
C  -1.260953 1.472687 0.099732
C  1.260264 1.473034 -0.094094
C  -0.000326 0.826468 0.001929
C  1.217965 2.91418 -0.092987
C  -1.218784 2.913824 0.102769
C  -0.000426 3.60582 0.005907
C  -2.499284 0.683886 0.176739
C  2.498729 0.684667 -0.173126
C  -2.596698 -0.648927 -0.143604
C  2.59609 -0.649446 0.141808
C  -3.816091 -1.460466 -0.06233
C  3.815772 -1.460345 0.058619
C  -3.797612 -2.87332 -0.277501
C  3.797371 -2.874067 0.268065
C  -5.093101 -0.880934 0.224515
C  5.092987 -0.879365 -0.224356
C  -4.96103 -3.664069 -0.209111
C  4.961062 -3.664257 0.197908
C  -6.262426 -1.655297 0.296797
C  6.262583 -1.653157 -0.298348
C  -6.201049 -3.052867 0.07982
C  6.201283 -3.051602 -0.087053
H  -0.000322 -0.265261 0.000595
H  -0.000466 4.698062 0.00748
H  -3.380633 1.23242 0.510776
H  3.38029 1.234646 -0.504219
H  -1.71251 -1.18786 -0.504136
H  1.711628 -1.190184 0.498944
H  -5.15944 0.200457 0.379571
H  5.159257 0.202659 -0.374969
H  -4.901168 -4.742751 -0.377694
H  4.901259 -4.743623 0.362076
H  -7.221083 -1.174318 0.515501
H  7.221386 -1.171076 -0.51397
H  -7.106647 -3.665942 0.131066
H  7.107091 -3.66425 -0.139659
