program: Gaussian 09
title: 000276858
version: EM64L-G09RevD.01
frameworkgroup: C1[X(C30H20N2O4)]
method: RPBEPBE
basis: SDD
operation: Freq
keyword: #p
keyword: freq=noraman
keyword: PBEPBE/SDD
title: #p freq=noraman PBEPBE/SDD
converged: YES YES NO NO
title: Mulliken charges:
elementType: O O O O N N C C C C C C C C C C C C C C C C C C C C C C C C C C C C C C H H H H H H H H H H H H H H H H H H H H
charge: -0.195671 -0.195664 -0.222903 -0.222894 0.022241 0.022239 0.436631 0.436563 0.185447 0.185466 0.380351 0.380346 0.404176 0.404177 -0.598414 0.216434 0.216414 -0.347070 -0.347051 -0.276624 -0.276658 -0.612672 -0.407014 -0.407017 -0.373060 -0.373073 -0.442497 -0.442491 -0.425320 -0.425315 -0.263923 -0.263924 -0.261794 -0.261799 -0.244891 -0.244891 0.229714 0.288028 0.288040 0.202830 0.202828 0.329279 0.242303 0.242296 0.216305 0.216324 0.244820 0.244820 0.242307 0.242306 0.237066 0.237066 0.233214 0.233213 0.234694 0.234694
chargesum: 0.00000
title: Mulliken charges with hydrogens summed into heavy atoms:
elementType: O O O O N N C C C C C C C C C C C C C C C C C C C C C C C C C C C C C C
charge: -0.195671 -0.195664 -0.222903 -0.222894 0.022241 0.022239 0.436631 0.436563 0.185447 0.185466 0.380351 0.380346 0.404176 0.404177 -0.368700 0.216434 0.216414 -0.059042 -0.059011 -0.073794 -0.073830 -0.283393 -0.164711 -0.164721 -0.156755 -0.156750 -0.197677 -0.197671 -0.183014 -0.183009 -0.026857 -0.026858 -0.028580 -0.028585 -0.010198 -0.010197
polarizability: 7.26574260e+02 -2.66729689e-02 6.96490441e+02 -5.46303434e+01 -1.55318138e-02 1.73322674e+02
1716.lowfreq: -5.9458 -0.0009 -0.0004 0.0006 1.8504 1.9779 6.6282 7.7564 18.0248
frequency: 6.2476 6.3614 17.9818 19.6473 32.0257 38.6422 41.8561 47.3624 60.3241 72.1264 76.1401 108.8711 126.6438 144.1456 149.9052 159.3469 172.9279 174.0227 176.3471 181.3247 206.8805 228.6122 260.2716 288.3905 324.5726 331.3494 363.7866 370.7781 385.8329 391.0102 417.2604 419.2514 445.0573 463.0382 466.1812 469.5282 471.4876 482.8482 498.5990 517.4575 520.0862 526.0770 542.9484 544.2193 591.1284 594.9111 609.6671 623.2120 640.8262 646.7502 653.5691 666.8987 686.8533 716.5129 725.8692 726.2928 743.2006 744.5137 746.2888 756.8992 783.0349 783.4101 785.7071 786.3217 811.9024 812.0197 813.7243 838.6698 867.2817 871.5818 877.2485 879.9923 886.6978 894.8190 907.0630 926.2601 926.6011 962.6889 963.4365 963.8007 978.5301 979.6586 995.3592 995.4397 997.7305 997.7414 1014.5097 1018.1404 1033.1494 1040.1979 1049.6679 1086.5612 1096.4570 1097.9968 1151.7754 1152.7247 1169.3106 1179.8839 1180.7056 1180.7386 1187.4904 1194.1490 1200.5260 1213.6551 1236.3961 1237.5557 1248.2572 1251.8573 1267.0673 1271.1238 1276.9844 1301.1365 1306.6353 1328.8859 1329.7887 1349.7422 1364.2608 1370.7027 1380.1379 1399.5082 1405.9271 1408.5127 1409.3886 1415.2224 1416.8585 1441.4688 1441.9576 1454.1155 1457.7667 1469.8550 1516.8757 1519.1730 1533.3492 1568.2962 1577.0389 1588.7153 1589.4387 1595.7299 1614.0162 1620.6109 1629.1258 1629.2512 3125.4554 3125.4575 3127.5373 3127.6120 3129.8961 3129.9018 3137.6193 3137.7017 3147.7818 3147.8110 3154.2676 3154.5978 3166.7625 3166.8215 3168.4254 3168.5148 3170.9516 3190.6384 3190.9030 3190.9576
redmass: 5.2375 5.1119 5.9749 9.8140 8.0267 7.2644 15.0657 5.7964 4.6598 3.9639 2.8159 3.0494 4.7563 6.2708 4.8961 5.3065 4.8726 3.9818 4.8302 5.9582 9.7627 3.7362 3.4978 4.6269 7.0842 9.2017 6.4554 8.6414 6.9076 5.3375 3.0330 3.0954 3.5711 5.3690 4.5529 3.2519 3.2940 7.3880 6.6813 6.7228 5.2044 6.2898 3.7762 3.1163 6.9354 5.8201 5.4746 5.2362 6.0182 3.4030 3.9424 7.8388 7.5577 6.1919 3.3479 9.5417 1.3863 1.3615 5.4416 12.8477 5.2772 5.4735 1.7628 1.8078 2.3214 1.5082 2.2843 6.6984 2.4294 3.5331 1.9783 1.8398 2.2352 2.5505 2.0483 1.4396 1.4565 1.4002 1.3941 1.4366 1.1986 1.2142 1.2804 1.2832 1.3832 1.3777 4.2169 4.3195 2.5371 2.2573 2.6421 5.6937 2.1162 2.4449 1.4574 1.4298 1.7273 2.5922 1.5886 1.1076 1.5498 9.6651 1.3810 2.1644 1.9526 1.9337 1.6622 1.6816 1.9727 1.7595 1.3490 1.7409 2.3468 2.0240 1.6656 3.3347 2.6906 4.4550 2.7764 4.5444 3.8114 2.7289 3.7837 4.7719 3.6738 2.4704 2.4469 2.3058 2.3318 3.1157 3.9391 3.5953 7.6062 5.2116 6.1479 5.4599 4.9712 5.5223 5.0287 5.6168 6.1481 6.1195 1.0868 1.0869 1.0888 1.0886 1.0874 1.0874 1.0883 1.0884 1.0911 1.0911 1.0932 1.0933 1.0989 1.0989 1.0994 1.0990 1.0892 1.0898 1.0879 1.0885
irintensity: 0.0802 0.2384 0.1121 0.1561 0.1825 1.9052 0.5268 0.0060 0.0221 9.0235 4.6103 2.8431 0.7330 2.4124 0.0011 6.1294 0.1457 3.1040 1.3509 0.7558 1.9062 2.2802 2.6363 3.0566 5.6178 0.2662 1.5904 9.8370 0.8101 0.1742 6.2620 3.2499 7.8191 1.4754 2.4027 0.7941 4.6025 9.3414 5.4316 9.5887 0.6377 10.7590 4.3763 13.8346 3.9337 4.9977 0.7754 1.0164 10.4141 0.6709 1.6321 4.0996 22.1386 0.2231 11.9888 0.2527 3.6722 0.6278 0.3102 23.8236 0.3658 0.7775 147.6823 7.2659 0.2150 75.5879 4.8338 16.0892 7.6606 1.4943 7.8775 1.1935 13.5662 1.6695 0.3109 0.3451 8.3104 1.7429 1.0742 24.7108 1.8457 92.5825 36.1602 0.8915 0.3593 18.0091 4.6939 1.3473 9.7400 20.7569 6.9294 0.0231 12.8349 12.3118 0.3880 5.2587 39.7834 297.3221 191.2733 15.4288 2.0541 982.8986 24.9512 32.1371 0.0391 26.4027 47.2044 18.9844 56.4563 16.3338 21.6455 34.8961 64.9471 3.7554 38.2847 64.6668 389.2951 26.4002 41.2921 58.4933 35.1218 7.8749 16.8654 10.5473 3.3888 2.5813 7.9621 22.8188 3.7652 25.6320 89.8855 3.6273 135.5177 612.2535 132.6274 3.3883 0.0835 318.4795 246.2860 5.7535 7.5389 2.0474 0.6383 1.4073 0.0473 18.8750 1.8373 1.4045 1.9615 0.3251 24.6399 5.8974 52.3604 41.3599 58.2488 10.9471 4.3148 17.7254 6.0070 0.7727 23.7777 45.2192
temp: 298.150 k
press: 1.00000 atm
elementType: 8 8 8 8 7 7 6 6 6 6 6 6 6 6 6 6 6 6 6 6 6 6 6 6 6 6 6 6 6 6 6 6 6 6 6 6 1 1 1 1 1 1 1 1 1 1 1 1 1 1 1 1 1 1 1 1
symmnumber: 1
zpe: 1097202.2 jmol-1
zpe.correction: 0.417902 hartree
zpe.thermalcorrener: 0.447491 hartree
zpe.thermalcorrenthalpy: 0.448435 hartree
zpe.thermalcorrgfe: 0.350529 hartree
zpe.sumelectzpe: -1562.990365 hartree
zpe.sumelectthermal: -1562.960776 hartree
zpe.sumelectthermalent: -1562.959832 hartree
zpe.sumelectthermalfe: -1563.057738 hartree
dipole: 0.0009 -10.9675 -0.0006
dipole: 10.9675
quadrupole: -184.4038 -231.6518 -212.2761
quadrupole: 0.0000 -4.8180 -0.0048
quadrupole: 25.0401 -22.2079 -2.8322 0.0000 -4.8180 -0.0048
hfenergy: -1563.4082671 hartree
pointgroup: C01 [X(C30H20N2O4)]
dipole: 0.0017234 4.3149388 0.0046033 debye
polarizability: 724.4016175|-0.0473859|696.4899663|64.6666609|0.4910636|175.4957916 unknown
InChI: InChI=1S/C30H20N2O4/c33-31(34)29-20-30(32(35)36)26(18-16-24-12-6-10-22-8-2-4-14-28(22)24)19-25(29)17-15-23-11-5-9-21-7-1-3-13-27(21)23/h1-20H
charge 0 multiplicity 1
56 atoms
O  2.302378 -5.869246 0.012457
O  -2.307425 -5.86735 -0.025848
O  3.473181 -4.129759 0.889691
O  -3.476963 -4.125271 -0.89952
N  2.395732 -4.630249 0.37025
N  -2.399829 -4.627614 -0.381249
C  -1.251856 -2.323082 -0.195097
C  1.24956 -2.324505 0.189056
C  -3.824645 2.000514 0.311329
C  3.826207 1.997836 -0.308515
C  -3.821365 0.605653 -0.119036
C  3.821462 0.602296 0.119636
C  -5.028208 2.791799 0.12072
C  5.030294 2.787808 -0.115791
C  -0.000895 -1.678059 -0.002294
C  1.204895 -3.766911 0.193975
C  -1.208343 -3.765529 -0.203184
C  -2.478615 -1.533162 -0.356842
C  2.476961 -1.53596 0.352586
C  -2.622705 -0.224162 0.046308
C  2.622168 -0.226203 -0.047706
C  -0.001998 -4.457271 -0.005353
C  -4.997435 0.074371 -0.697562
C  4.996692 0.069101 0.698106
C  -2.695995 2.649525 0.91629
C  2.698553 2.648728 -0.913316
C  -6.185605 2.195757 -0.474787
C  6.186781 2.189845 0.479559
C  -5.051884 4.166189 0.532051
C  5.055402 4.162835 -0.524904
C  -6.167814 0.856372 -0.875146
C  6.167606 0.849828 0.877736
C  -2.746942 3.990265 1.30902
C  2.750898 3.990047 -1.303879
C  -3.934239 4.7612 1.116044
C  3.93868 4.759697 -1.108776
H  -0.000451 -0.585858 -0.001045
H  -3.315908 -2.061259 -0.81363
H  3.313806 -2.065795 0.808189
H  -1.779165 0.247318 0.563085
H  1.779079 0.247081 -0.563569
H  -0.002423 -5.549543 -0.006525
H  -5.020525 -0.972409 -1.015422
H  5.018653 -0.978178 1.014398
H  -1.766665 2.098909 1.08764
H  1.768925 2.09913 -1.086316
H  -7.086748 2.805533 -0.608906
H  7.088329 2.798662 0.615303
H  -5.971832 4.742484 0.378245
H  5.975707 4.738132 -0.369501
H  -7.056079 0.401726 -1.325456
H  7.055175 0.393723 1.327943
H  -1.868984 4.454417 1.771449
H  1.873679 4.455648 -1.766256
H  -3.961197 5.810386 1.428412
H  3.966736 5.809357 -1.419448
