program: Gaussian 09
title: 000276792
version: EM64L-G09RevD.01
frameworkgroup: C1[X(C11H15N5O2)]
method: RPBEPBE
basis: SDD
operation: Freq
keyword: #p
keyword: freq=noraman
keyword: PBEPBE/SDD
title: #p freq=noraman PBEPBE/SDD
converged: YES YES NO NO
title: Mulliken charges:
elementType: O O N N N N N C C C C C C C C C C C H H H H H H H H H H H H H H H
charge: -0.293921 -0.273358 -0.318141 -0.198684 -0.633061 -0.624126 -0.634272 0.226979 0.302568 -0.353386 -0.325770 -0.397695 -0.390478 0.178782 -0.257673 -0.666929 0.184561 0.247308 0.264840 0.265968 0.267697 0.243345 0.232979 0.217091 0.212561 0.224211 0.250727 0.330777 0.343076 0.340924 0.310186 0.429334 0.293578
chargesum: 0.00000
title: Mulliken charges with hydrogens summed into heavy atoms:
elementType: O O N N N N N C C C C C C C C C C C
charge: -0.293921 -0.273358 -0.318141 -0.198684 0.040792 0.026984 0.088641 0.226979 0.302568 -0.088545 -0.059802 -0.129998 -0.147132 0.178782 0.192397 0.020569 0.184561 0.247308
polarizability: 3.48848885e+02 -4.39903725e+00 1.54206282e+02 3.20652688e+00 -2.63674309e+00 9.41059277e+01
1716.lowfreq: -3.4361 0.0007 0.0008 0.0011 2.7001 7.7071 28.8569 31.0040 54.6833
frequency: 28.7700 30.9940 54.6824 63.1720 65.9460 90.4825 106.9864 135.4593 148.7626 174.6358 196.2929 220.7942 271.0448 290.4022 307.7741 316.9156 357.5227 376.0211 412.2085 423.9937 427.5736 459.7128 474.5244 478.9029 503.3159 531.7183 535.5860 540.7880 601.1527 629.2328 679.3815 684.8963 695.3491 709.6957 741.2639 756.8022 804.1050 816.3488 843.1308 850.5696 868.8094 879.1866 957.0689 983.5419 992.1242 994.1399 997.6062 1009.5362 1034.1509 1055.2339 1083.5577 1095.8320 1111.5072 1153.4253 1169.0874 1176.7503 1251.4936 1274.5806 1280.1273 1294.4225 1351.9262 1358.0240 1388.2506 1409.7188 1431.8018 1448.7426 1454.5223 1461.8853 1484.2264 1492.8380 1517.8845 1533.7015 1550.1679 1595.1435 1601.8846 1611.0892 1616.0555 1651.3090 2892.9090 2990.4063 3025.7263 3085.1720 3089.2484 3115.0284 3132.1157 3144.9133 3155.8263 3174.6239 3544.0943 3560.2724 3602.3193 3700.1323 3715.5065
redmass: 4.6478 4.0105 3.3711 5.7624 4.0801 4.8595 4.1914 5.7760 3.3940 5.9638 3.2991 1.3984 1.1500 4.4008 4.0355 3.1692 4.7339 3.9562 2.7714 3.8897 3.4147 1.2147 1.2835 3.4012 2.3375 1.1661 3.1764 1.2497 5.5775 6.9516 5.3328 6.5219 4.8072 8.0336 3.6041 4.2557 3.1117 1.6515 3.3081 1.2919 1.7601 4.0942 1.0889 1.3384 1.5775 2.4030 2.6594 2.5145 1.8655 4.6487 1.7347 2.1396 1.3482 1.6537 1.8338 1.1923 3.1157 4.0563 1.1165 1.3154 4.1962 1.3141 1.2345 3.0889 4.1202 2.2728 1.1076 1.0445 1.0598 2.5433 3.2591 3.5823 6.5494 1.5195 2.1798 3.1653 4.0727 2.4022 1.0761 1.0360 1.0589 1.0979 1.1033 1.1054 1.0876 1.0888 1.0960 1.0959 1.0440 1.0451 1.0833 1.1054 1.1052
irintensity: 1.0458 1.2482 0.2048 1.1448 1.5842 0.6587 0.2962 8.7266 3.9218 6.2703 6.5643 9.1292 47.3539 10.8505 12.8794 18.6008 9.0684 8.8429 5.0582 8.7003 0.6861 42.3217 546.2986 43.1811 22.4090 9.1951 3.6097 46.7706 1.4515 3.5980 26.1639 25.4107 3.5714 41.8019 15.8653 13.5341 26.9371 2.0798 5.7733 5.5894 42.6697 18.0904 136.3345 0.0412 9.9475 9.7354 9.0383 28.4403 1.3273 497.2786 9.1279 30.6137 12.4494 94.7923 10.6291 146.0593 455.6650 265.7324 1.0469 3.7620 4.6272 23.5644 26.4180 116.7230 67.6599 463.9221 57.4431 13.5280 27.8835 76.9251 138.8150 1364.5396 68.7736 142.2506 589.5943 517.3128 203.6827 638.1496 786.8963 27.4733 45.6439 44.0595 4.6074 34.2089 4.6577 8.3327 7.1523 4.7533 49.2315 108.9576 33.7993 50.4855 38.2318
temp: 298.150 k
press: 1.00000 atm
elementType: 8 8 7 7 7 7 7 6 6 6 6 6 6 6 6 6 6 6 1 1 1 1 1 1 1 1 1 1 1 1 1 1 1
symmnumber: 1
zpe: 684183.6 jmol-1
zpe.correction: 0.260592 hartree
zpe.thermalcorrener: 0.278842 hartree
zpe.thermalcorrenthalpy: 0.279786 hartree
zpe.thermalcorrgfe: 0.213016 hartree
zpe.sumelectzpe: -851.085434 hartree
zpe.sumelectthermal: -851.067184 hartree
zpe.sumelectthermalent: -851.066240 hartree
zpe.sumelectthermalfe: -851.133010 hartree
dipole: 5.4075 -2.2416 0.9265
dipole: 5.9266
quadrupole: -64.2408 -94.4253 -109.0854
quadrupole: -1.4335 -8.3275 6.0556
quadrupole: 25.0097 -5.1748 -19.8349 -1.4335 -8.3275 6.0556
hfenergy: -851.3460261 hartree
pointgroup: C01 [X(C11H15N5O2)]
dipole: 2.1567519 -0.8657857 -0.1887739 debye
polarizability: 348.8866984|-0.3907362|134.7101048|4.9291818|28.1933603|113.5642912 unknown
InChI: InChI=1S/C11H15N5O2/c1-2-18-9(17)7-3-5-8(6-4-7)15-11(14)16-10(12)13/h3-6H,2,12-14H2,1H3
charge 0 multiplicity 1
33 atoms
O  -4.149448 -1.074605 -0.57722
O  -4.135264 1.193439 -0.009085
N  2.213297 -0.412832 0.066565
N  4.433311 0.136053 0.828387
N  2.635805 0.834488 2.09061
N  6.410683 -0.454601 -0.226129
N  4.355814 -1.163431 -1.188807
C  -2.033758 -0.039251 -0.136116
C  0.816924 -0.252846 0.05867
C  -1.243109 1.098904 0.177152
C  -1.384856 -1.283273 -0.369508
C  0.154204 1.000381 0.275031
C  0.011716 -1.384959 -0.277618
C  -3.504133 0.123274 -0.219579
C  -5.636581 -1.018846 -0.660598
C  -6.268283 -1.275658 0.711583
C  3.051228 0.173974 0.94483
C  5.029195 -0.496924 -0.201984
H  -1.749989 2.057866 0.331256
H  -1.990896 -2.158824 -0.61902
H  0.749336 1.899294 0.471422
H  0.516263 -2.340626 -0.45466
H  -5.93216 -0.030865 -1.055558
H  -5.888615 -1.810279 -1.385333
H  -7.369709 -1.314104 0.616393
H  -5.922937 -2.236968 1.130078
H  -6.010712 -0.466236 1.414939
H  3.357428 1.172872 2.722137
H  1.654197 0.873304 2.353306
H  6.868249 0.04918 0.529212
H  6.961561 -0.886017 -0.962132
H  3.305386 -1.117445 -1.045918
H  4.823256 -1.64754 -1.952409
