program: Gaussian 09
title: 000276844
version: EM64L-G09RevD.01
frameworkgroup: C1[X(C24H20N2O8)]
method: RPBEPBE
basis: SDD
operation: Freq
keyword: #p
keyword: freq=noraman
keyword: PBEPBE/SDD
title: #p freq=noraman PBEPBE/SDD
converged: YES YES NO NO
title: Mulliken charges:
elementType: O O O O O O O O N N C C C C C C C C C C C C C C C C C C C C C C C C H H H H H H H H H H H H H H H H H H H H
charge: -0.285079 -0.285071 -0.435266 -0.435288 -0.199808 -0.199797 -0.221488 -0.221507 0.021960 0.021957 0.430263 0.430088 -0.599650 0.219995 0.219993 -0.601432 -0.342744 -0.342688 0.573218 0.573195 -0.322364 -0.322419 -0.513703 -0.513703 -0.429191 -0.429161 0.220923 0.220910 0.174120 0.174120 -0.375262 -0.375244 -0.520054 -0.520097 0.238796 0.328549 0.293294 0.293267 0.224186 0.224237 0.268055 0.268032 0.234102 0.234108 0.220882 0.220886 0.366632 0.366633 0.236562 0.216414 0.261324 0.236549 0.261357 0.216413
chargesum: 0.00000
title: Mulliken charges with hydrogens summed into heavy atoms:
elementType: O O O O O O O O N N C C C C C C C C C C C C C C C C C C C C C C C C
charge: -0.285079 -0.285071 -0.068633 -0.068655 -0.199808 -0.199797 -0.221488 -0.221507 0.021960 0.021957 0.430263 0.430088 -0.360855 0.219995 0.219993 -0.272884 -0.049451 -0.049422 0.573218 0.573195 -0.098178 -0.098182 -0.245648 -0.245671 -0.195090 -0.195053 0.220923 0.220910 0.174120 0.174120 -0.154380 -0.154358 0.194246 0.194222
polarizability: 7.96955077e+02 2.93204469e-02 5.47980673e+02 -8.60106313e+00 -3.35287399e-02 1.54367078e+02
1716.lowfreq: -2.4275 -0.0012 0.0000 0.0004 2.4482 4.4968 13.4611 14.2817 18.2099
frequency: 13.4469 14.2785 18.2039 24.5807 30.8993 41.3481 42.1077 44.0162 59.0430 69.2025 69.2719 87.4212 92.6611 120.2026 131.0413 138.1234 142.9437 155.6827 173.9896 175.7193 184.9312 185.0524 221.6083 222.1437 233.9051 252.2930 273.8727 281.6649 318.9840 319.2021 334.0139 334.3681 363.8479 368.0090 369.0249 373.9362 387.1455 389.2588 395.6638 408.3413 446.6100 453.7755 458.4465 465.1520 489.0134 491.9532 527.1770 551.3191 576.6247 581.7209 600.3651 611.4963 627.5912 636.4009 646.2939 665.4272 685.0139 711.1943 715.9406 720.3699 721.4492 730.7169 732.3683 756.1245 760.5738 782.7637 793.4408 793.4668 807.7987 837.0304 874.9628 884.7325 896.1461 900.4601 901.1821 907.7104 914.8433 924.8950 925.5897 963.2120 984.6511 984.8327 999.3859 999.8072 1037.2412 1081.7353 1081.8915 1088.8599 1113.0433 1113.1353 1152.4393 1152.8470 1159.3135 1165.0452 1167.2877 1171.0513 1177.6666 1184.8806 1196.0426 1207.1122 1231.1548 1234.6768 1264.0484 1264.2997 1276.1104 1276.9633 1277.4915 1297.9596 1302.0785 1319.7963 1332.4164 1351.7281 1366.4728 1394.7473 1403.2732 1405.6999 1407.2612 1417.6864 1417.8347 1444.4295 1445.0625 1458.8072 1459.0841 1464.8097 1479.2562 1479.3236 1496.5472 1498.8628 1532.9242 1579.3430 1579.8617 1581.9920 1605.5228 1612.9806 1624.6981 1626.8340 2982.0814 2982.1676 3088.7951 3089.0144 3092.1832 3092.2123 3112.3574 3112.4180 3134.5477 3134.5760 3144.4842 3144.5732 3164.6615 3164.6672 3169.6038 3184.5762 3184.6696 3190.8347 3574.0328 3574.2528
redmass: 4.6408 5.2708 7.4644 8.2592 9.0012 14.0518 8.2354 6.3216 3.3526 2.7125 3.4287 6.5131 4.4565 2.8572 1.8536 1.9927 3.7468 5.0720 3.1946 2.6406 4.2018 8.1366 2.8351 3.2801 5.0476 4.1363 5.4681 5.5543 4.9160 5.9333 5.0477 6.1560 9.0154 1.2618 1.1700 4.4902 3.8272 4.9070 5.9480 6.3432 3.2522 3.2081 3.4173 6.2067 7.0343 4.6259 6.9960 7.2788 4.6222 4.7859 6.0817 4.7643 6.5532 4.4831 5.2241 8.8195 8.1462 6.2543 6.0400 3.4992 5.0672 5.2720 3.4515 11.3896 6.7083 5.7864 1.4977 1.4509 4.5709 6.6498 1.6325 1.7826 1.9981 2.0457 2.1405 3.6308 2.4276 1.4332 1.5009 1.4406 1.1478 1.1557 3.2117 3.1824 3.0442 2.3055 2.2147 7.5783 1.2383 1.2385 1.3992 1.3700 1.8673 1.3085 1.2611 2.2501 3.7733 3.5143 10.0678 3.4209 1.6850 1.7439 2.1765 2.3577 1.4596 1.4999 1.4281 1.6939 1.9738 1.7501 2.3080 7.3487 5.7290 5.8283 5.7612 5.3440 4.4004 1.8993 1.8949 1.6214 1.6411 1.1045 1.0727 2.8982 1.0576 1.0569 3.0824 3.0512 8.9423 6.0015 5.9935 5.3245 5.8936 6.6272 5.4614 5.5466 1.0342 1.0342 1.0892 1.0894 1.0982 1.0982 1.0882 1.0882 1.1047 1.1047 1.0957 1.0957 1.0919 1.0919 1.0891 1.0883 1.0883 1.0908 1.0660 1.0661
irintensity: 0.3126 0.4267 0.9409 0.2950 0.0804 0.1711 0.8522 0.9073 3.6632 8.9969 4.0401 5.5921 1.1851 1.0332 7.9831 0.0169 1.9124 2.4217 5.0716 6.4199 5.4830 2.0708 0.1838 0.7664 0.4482 9.5089 5.0278 1.1902 0.0247 19.1017 6.3129 1.7622 24.8549 15.7628 240.2764 5.5623 19.0315 7.3025 1.6593 9.1178 3.1499 0.0476 9.9465 8.2820 23.2564 15.2282 22.2467 2.3942 16.2528 0.3812 0.5355 0.5096 4.0622 26.4168 0.8819 6.6364 25.1331 0.0978 7.1057 5.3603 0.0003 0.0719 0.9821 14.4996 19.6110 16.2538 22.7026 70.3417 4.8535 32.8520 1.5105 1.2140 30.6033 10.8091 8.3960 0.2201 13.9799 1.3637 3.9022 33.6493 18.0513 189.5856 145.9823 0.7831 13.2242 278.0209 127.8476 20.3731 16.0466 8.0124 112.1238 38.2167 0.2766 5.3471 181.5784 0.6632 63.0064 767.0960 944.7956 13.7528 16.9617 212.0502 692.6709 111.3847 8.7943 83.2063 289.0154 120.7719 20.1177 65.6487 66.9312 22.6683 174.7684 205.6680 0.6286 28.0605 22.5600 25.3285 4.8601 148.4848 4.8851 9.0099 23.9840 0.7533 68.2547 12.3725 43.0002 445.1721 219.7176 88.2802 15.8615 1170.3843 360.4101 4.2782 131.6174 62.8444 202.4289 5.0093 22.6442 1.2120 44.6946 30.2549 22.1105 28.0024 14.3322 12.9717 6.5025 17.7752 1.0805 0.5739 2.5065 26.2228 23.3893 23.6975 139.8048 129.7038
temp: 298.150 k
press: 1.00000 atm
elementType: 8 8 8 8 8 8 8 8 7 7 6 6 6 6 6 6 6 6 6 6 6 6 6 6 6 6 6 6 6 6 6 6 6 6 1 1 1 1 1 1 1 1 1 1 1 1 1 1 1 1 1 1 1 1
symmnumber: 1
zpe: 1035247.2 jmol-1
zpe.correction: 0.394305 hartree
zpe.thermalcorrener: 0.426621 hartree
zpe.thermalcorrenthalpy: 0.427565 hartree
zpe.thermalcorrgfe: 0.325334 hartree
zpe.sumelectzpe: -1635.197498 hartree
zpe.sumelectthermal: -1635.165182 hartree
zpe.sumelectthermalent: -1635.164238 hartree
zpe.sumelectthermalfe: -1635.266469 hartree
dipole: 0.0002 -14.0505 0.0019
dipole: 14.0505
quadrupole: -162.0227 -197.9007 -200.7433
quadrupole: 0.0089 27.8883 -0.0241
quadrupole: 24.8662 -11.0118 -13.8544 0.0089 27.8883 -0.0241
hfenergy: -1635.5918031 hartree
pointgroup: C01 [X(C24H20N2O8)]
dipole: -0.0000762 5.5278657 -0.0191005 debye
polarizability: 792.8058456|0.1552217|547.9761479|52.1822343|-1.3277177|158.5208343 unknown
InChI: InChI=1S/C24H20N2O8/c1-33-23-11-15(5-9-21(23)27)3-7-17-13-18(20(26(31)32)14-19(17)25(29)30)8-4-16-6-10-22(28)24(12-16)34-2/h3-14,27-28H,1-2H3
charge 0 multiplicity 1
54 atoms
O  -7.208795 1.06779 -1.421024
O  7.206682 1.079098 1.418408
O  -7.203161 3.68088 -0.218776
O  7.202168 3.682154 0.195373
O  2.306881 -5.343813 -0.032364
O  -2.308221 -5.343203 0.069249
O  3.50195 -3.593691 0.790677
O  -3.502979 -3.598385 -0.765448
N  2.409075 -4.101334 0.313088
N  -2.410238 -4.102991 -0.284327
C  -1.25696 -1.801068 -0.141973
C  1.25607 -1.800272 0.155747
C  -0.000391 -1.153981 0.004764
C  1.211663 -3.242155 0.171474
C  -1.212745 -3.243032 -0.148193
C  -0.000585 -3.934054 0.013921
C  -2.486755 -1.007437 -0.254198
C  2.485927 -1.005987 0.262813
C  -3.812956 1.125949 0.091291
C  3.812212 1.124917 -0.097606
C  -2.618787 0.285904 0.198283
C  2.618183 0.283988 -0.199114
C  -5.003119 0.71294 -0.575502
C  5.001755 0.717228 0.573569
C  -3.794768 2.420285 0.687103
C  3.794497 2.414556 -0.703524
C  -6.13283 1.545658 -0.664175
C  6.131303 1.550705 0.656789
C  -6.082405 2.848879 -0.073523
C  6.081405 2.849204 0.055818
C  -4.914934 3.265907 0.607097
C  4.914557 3.26084 -0.629134
C  -8.573109 1.172202 -0.85625
C  8.571284 1.17898 0.853499
H  -0.000293 -0.06151 0.001263
H  -0.000676 -5.026318 0.017469
H  -3.342704 -1.515418 -0.700885
H  3.341632 -1.510724 0.713644
H  -1.778118 0.755324 0.730252
H  1.777806 0.749317 -0.735126
H  -5.079551 -0.270416 -1.049026
H  5.077724 -0.262317 1.054999
H  -2.89717 2.759763 1.216317
H  2.897379 2.749808 -1.236234
H  -4.883303 4.264034 1.063727
H  4.88335 4.255327 -1.093672
H  -7.036935 4.568321 0.186804
H  7.0364 4.566401 -0.217304
H  -9.217701 0.678595 -1.598516
H  -8.629701 0.632182 0.10808
H  -8.868475 2.224569 -0.721008
H  9.215561 0.691566 1.600117
H  8.866608 2.230253 0.709812
H  8.628389 0.631083 -0.106346
