program: Gaussian 09
title: 000276806
version: EM64L-G09RevD.01
frameworkgroup: C1[X(C13H16ClNO4)]
method: RPBEPBE
basis: SDD
operation: Freq
keyword: #p
keyword: freq=noraman
keyword: PBEPBE/SDD
title: #p freq=noraman PBEPBE/SDD
converged: YES YES NO NO
title: Mulliken charges:
elementType: Cl O O O O N C C C C C C C C C C C C C H H H H H H H H H H H H H H H H
charge: -0.054922 -0.457555 -0.276704 -0.223875 -0.274632 -0.379663 -0.196592 -0.282266 0.460684 0.257201 -0.406734 -0.367054 0.279129 -0.201318 -0.209983 -0.107365 -0.255965 -0.776865 -0.660124 0.308537 0.249574 0.326291 0.239749 0.265029 0.351592 0.255977 0.254554 0.222178 0.237249 0.254048 0.255211 0.214709 0.217748 0.253191 0.228965
chargesum: 0.00000
title: Mulliken charges with hydrogens summed into heavy atoms:
elementType: Cl O O O O N C C C C C C C C C C C C C
charge: -0.054922 -0.105964 -0.276704 -0.223875 -0.274632 -0.053371 0.111945 -0.032692 0.460684 0.257201 -0.166985 -0.102025 0.279129 0.054659 0.044571 -0.107365 0.203462 -0.052897 0.039781
polarizability: 2.23467932e+02 1.22367188e+01 1.49495168e+02 -1.11269156e+01 1.67944249e+01 1.34686616e+02
1716.lowfreq: -7.7986 -2.8811 -0.0011 -0.0009 0.0011 4.4449 8.1774 28.8153 33.7868
frequency: 3.6438 28.7814 33.7585 39.3731 47.4560 53.3005 70.0222 79.0260 90.8131 122.5342 138.7579 161.5648 170.4331 207.9209 240.1096 261.0783 278.8719 300.0997 320.2247 327.2182 332.5345 377.7967 410.8929 418.1861 444.4773 485.5319 515.5729 556.6666 568.5312 595.9380 610.7704 623.8305 656.0948 695.9760 719.3941 737.0945 789.3659 816.1108 822.8770 830.6225 842.8706 892.9802 917.0398 953.9136 961.8053 967.5199 986.6442 1000.5328 1013.5988 1019.3054 1042.3141 1071.6740 1096.7523 1108.3916 1117.3038 1146.2798 1156.9181 1180.3838 1199.1753 1208.9694 1252.7199 1270.6114 1277.4162 1289.5448 1302.1283 1322.0346 1340.5680 1355.7863 1385.4777 1387.9740 1392.7722 1398.2285 1451.3354 1457.7173 1463.7103 1464.0622 1475.6646 1481.3434 1484.6958 1588.8375 1600.6429 1616.2905 1649.1913 2994.4020 2998.2445 2998.4813 3019.5919 3031.6978 3089.5265 3095.0959 3099.3777 3102.4450 3121.0546 3128.0284 3149.8105 3170.7195 3173.8438 3570.1549 3571.8464
redmass: 4.5985 4.0760 3.6133 3.6711 1.7020 4.5079 4.4333 2.5388 5.0432 3.8258 6.1697 6.3810 6.5313 1.3540 6.0656 5.1452 2.3635 3.8450 4.0304 1.4697 3.0661 5.7968 2.8920 3.2694 5.7422 3.6472 3.3865 2.0434 4.5378 2.2625 3.5767 6.6129 4.8302 4.8476 4.4961 3.6670 2.1377 1.7749 2.0750 1.2653 2.6717 3.4606 3.7844 1.3938 3.7789 1.3661 1.8224 3.7442 2.7607 4.1662 1.6497 2.7426 2.1799 1.3756 2.7220 2.5108 1.6614 1.1148 1.6537 2.0013 1.6959 1.4493 1.1200 1.3860 1.5866 1.7353 1.4201 1.2828 5.5585 1.2345 1.2308 2.2948 1.0467 1.0902 1.0931 1.1202 2.2659 1.9098 1.0586 7.3871 6.2745 6.5763 9.9963 1.0362 1.0844 1.0359 1.0825 1.0593 1.0974 1.1036 1.0980 1.1009 1.1062 1.0900 1.0884 1.0955 1.0967 1.0773 1.0667
irintensity: 1.4187 0.1463 0.6368 0.2890 4.0409 5.1763 5.4591 6.3097 0.4684 3.0390 4.3660 1.8551 1.0192 6.0006 3.1820 6.6190 3.8158 8.0353 16.1508 147.8662 8.1342 10.9240 0.6988 16.5964 15.1653 28.6711 33.4790 73.9596 28.3285 36.6179 3.6456 1.2468 26.4495 25.5935 19.5678 32.0112 12.3792 14.1736 10.7900 1.0021 31.3316 25.3306 17.4447 0.6653 2.7074 0.1315 6.3570 46.0233 71.5165 58.3992 12.2828 43.6451 35.9920 3.6309 141.3475 204.9649 8.4399 1.4167 11.6828 24.7102 30.9036 93.8979 1.5755 63.5763 68.2450 26.1063 12.5293 2.0342 1.7790 67.0423 25.5781 10.2535 14.8720 14.0133 22.9476 71.8216 62.6913 154.8345 22.6068 1.7391 21.8303 153.9795 153.4313 19.2565 14.9390 8.6102 35.1812 27.2303 34.3981 0.6887 7.8712 17.8956 29.0412 8.2965 2.6792 6.1856 0.4817 27.6813 17.1926
temp: 298.150 k
press: 1.00000 atm
elementType: 17 8 8 8 8 7 6 6 6 6 6 6 6 6 6 6 6 6 6 1 1 1 1 1 1 1 1 1 1 1 1 1 1 1 1
symmnumber: 1
zpe: 711124.3 jmol-1
zpe.correction: 0.270853 hartree
zpe.thermalcorrener: 0.291412 hartree
zpe.thermalcorrenthalpy: 0.292356 hartree
zpe.thermalcorrgfe: 0.216323 hartree
zpe.sumelectzpe: -1319.277208 hartree
zpe.sumelectthermal: -1319.256649 hartree
zpe.sumelectthermalent: -1319.255705 hartree
zpe.sumelectthermalfe: -1319.331738 hartree
dipole: -1.8290 -2.6836 2.6393
dipole: 4.1848
quadrupole: -122.5450 -107.3010 -119.8928
quadrupole: 10.3880 7.1887 8.0882
quadrupole: -5.9654 9.2786 -3.3132 10.3880 7.1887 8.0882
hfenergy: -1319.5480611 hartree
pointgroup: C01 [X(C13H16Cl1N1O4)]
dipole: 0.6049127 -1.1095216 -1.0553523 debye
polarizability: 220.3772355|-17.795729|151.206683|-15.579558|-15.4287641|136.0657977 unknown
InChI: InChI=1S/C13H16ClNO4/c1-3-19-13(18)11(15-8(2)16)12(17)9-4-6-10(14)7-5-9/h4-7,11-12,15,17H,3H2,1-2H3
charge 0 multiplicity 1
35 atoms
Cl -5.804229 -0.178074 0.803618
O  0.401816 -0.77813 -2.096867
O  2.812744 -1.555366 0.219085
O  3.370466 0.469396 -0.804006
O  0.241432 2.141109 1.777783
N  0.783359 1.445716 -0.373157
C  1.062791 0.078925 0.035985
C  0.128534 -0.958162 -0.657545
C  -1.341021 -0.766751 -0.314093
C  2.534605 -0.272893 -0.247696
C  -1.91329 -1.486372 0.763615
C  -2.151571 0.134943 -1.047523
C  0.414514 2.415283 0.550981
C  -3.268983 -1.310128 1.116337
C  -3.511304 0.319309 -0.713415
C  -4.047553 -0.407035 0.36704
C  4.217352 -2.045067 0.03253
C  0.229354 3.820117 -0.007279
C  5.105176 -1.587563 1.192112
H  0.889181 0.033489 1.128346
H  0.462397 -1.962166 -0.32671
H  1.001754 1.696717 -1.338218
H  -1.299813 -2.189568 1.340173
H  -1.714246 0.692285 -1.881804
H  -0.155009 -1.412504 -2.614273
H  -3.709738 -1.863272 1.950416
H  -4.139707 1.014284 -1.277893
H  4.106211 -3.140588 -0.001349
H  4.590172 -1.667809 -0.935729
H  -0.793622 4.165434 0.220847
H  0.927362 4.504372 0.505165
H  0.398429 3.887216 -1.095586
H  6.116536 -2.020284 1.078492
H  5.200396 -0.489066 1.202258
H  4.693905 -1.920595 2.160463
