program: Gaussian 09
title: 000276786
version: EM64L-G09RevD.01
frameworkgroup: C1[X(C11H8N2O4)]
method: RPBEPBE
basis: SDD
operation: Freq
keyword: #p
keyword: freq=noraman
keyword: PBEPBE/SDD
title: #p freq=noraman PBEPBE/SDD
converged: YES YES NO NO
title: Mulliken charges:
elementType: O O O O N N C C C C C C C C C C C H H H H H H H H
charge: -0.210229 -0.185013 -0.195482 -0.201429 -0.386590 0.022316 0.251750 -0.633894 -0.382806 0.513964 0.085233 0.138575 -0.466896 -0.413196 0.358937 -0.200541 -0.367912 0.281566 0.280968 0.265177 0.355021 0.299464 0.249991 0.247144 0.293879
chargesum: 0.00000
title: Mulliken charges with hydrogens summed into heavy atoms:
elementType: O O O O N N C C C C C C C C C C C
charge: -0.210229 -0.185013 -0.195482 -0.201429 -0.031569 0.022316 0.251750 -0.071359 -0.117629 0.513964 0.085233 0.138575 -0.167432 -0.163205 0.358937 0.046603 -0.074033
polarizability: 2.49009856e+02 -1.23522622e+01 1.78704921e+02 -3.30004720e-01 7.28018127e-02 5.92020144e+01
1716.lowfreq: -8.0295 -1.6103 0.0005 0.0007 0.0008 3.9588 23.7766 51.8678 66.4436
frequency: 23.5906 51.8661 66.4436 80.6396 137.5462 160.8908 166.9024 172.8597 236.6651 262.0098 302.0227 380.6167 394.0845 407.2865 433.9562 495.2934 536.4980 541.0277 559.5459 585.6877 616.7582 653.1896 667.0352 680.3945 695.2627 711.5454 753.3905 764.2476 817.9392 821.9734 877.3740 918.1924 923.0382 944.0679 950.0397 976.5409 987.5557 1006.3842 1072.3496 1087.6408 1090.3866 1151.8658 1173.3242 1181.7398 1212.3575 1234.2796 1240.9596 1284.0005 1299.4935 1320.9976 1370.3806 1377.5394 1405.9968 1426.2036 1440.6191 1480.8244 1578.1930 1614.4844 1642.5380 1682.7236 1694.9168 2999.4549 3052.0574 3092.3846 3137.9484 3164.7778 3189.8258 3211.3182 3557.7116
redmass: 8.4831 12.2154 9.8738 5.2290 3.6192 9.8433 7.1143 5.1802 10.1880 3.7485 6.1006 9.3282 8.7087 2.8628 3.2149 8.3309 3.0103 5.5384 3.1835 7.6350 8.9262 6.2207 6.9962 2.3007 2.4219 3.4489 1.9606 8.9369 5.2597 1.4685 3.0585 4.8010 1.4624 1.5282 2.0534 1.4905 6.1012 1.3821 3.3060 1.7645 1.9333 1.1467 2.7592 1.2766 8.0122 1.7634 3.2639 2.3242 1.7604 1.7221 2.6893 11.0286 2.7678 1.0980 2.7120 2.7966 6.2575 6.9346 8.1940 8.6398 11.6705 1.0611 1.1003 1.0884 1.0897 1.0932 1.0966 1.0907 1.0795
irintensity: 0.8656 0.5369 1.3006 0.4001 5.9065 0.2057 5.5402 1.0688 5.4044 0.1308 0.3612 0.7908 24.5169 1.6700 3.2149 4.6333 16.4860 4.0461 0.1226 21.7926 14.4246 6.2531 11.2722 1.6842 53.0858 8.3849 121.9558 21.4124 21.6813 35.4114 4.2500 0.0371 3.3267 16.4861 0.1037 15.5671 1.1327 3.7661 39.3987 30.6106 6.3418 0.8042 200.7551 41.3443 278.6371 36.8911 32.4999 98.3125 123.7405 9.8446 2.3954 106.7317 3.0566 13.5630 9.5688 46.1326 4.1581 17.6775 389.3664 155.5768 260.6253 1.6408 0.9930 0.6897 4.1444 12.5872 3.9145 1.6124 86.6546
temp: 298.150 k
press: 1.00000 atm
elementType: 8 8 8 8 7 7 6 6 6 6 6 6 6 6 6 6 6 1 1 1 1 1 1 1 1
symmnumber: 1
zpe: 461935.9 jmol-1
zpe.correction: 0.175942 hartree
zpe.thermalcorrener: 0.189886 hartree
zpe.thermalcorrenthalpy: 0.190830 hartree
zpe.thermalcorrgfe: 0.133286 hartree
zpe.sumelectzpe: -833.116022 hartree
zpe.sumelectthermal: -833.102078 hartree
zpe.sumelectthermalent: -833.101134 hartree
zpe.sumelectthermalfe: -833.158678 hartree
dipole: -0.9237 4.5787 0.0239
dipole: 4.6710
quadrupole: -109.2819 -111.3218 -96.8168
quadrupole: -15.3529 -0.0924 0.1622
quadrupole: -3.4751 -5.5149 8.9901 -15.3529 -0.0924 0.1622
hfenergy: -833.2919639 hartree
pointgroup: C01 [X(C11H8N2O4)]
dipole: 0.2929413 1.8126129 0.0762984 debye
dipolederiv: -0.8994545 0.198601 0.0785287 0.4422103 -0.9585125 -0.09643 0.0949327 -0.0680644 -0.3493358 -0.6534558 -0.2865528 0.0136693 -0.4277591 -1.1806008 -0.0142684 0.0028557 -0.030403 -0.344681 -0.8834965 0.0762532 0.0814244 0.2192487 -0.4795026 -0.0396127 0.0899085 -0.023656 -0.2316783 -0.532546 -0.0621165 0.0333895 0.0145012 -0.7591492 -0.0315497 0.0377264 -0.0237402 -0.2224857 -0.7234651 -0.029712 0.0414676 -0.3783656 -1.5762907 -0.0487439 0.0157786 -0.0872754 -0.3485459 1.3030581 -0.2074936 -0.1420919 -0.4990508 1.3797769 0.123974 -0.159073 0.0924383 0.209843 -1.1138111 -0.1533995 0.1075768 0.0615675 0.1548644 0.0085962 0.1247119 0.0326756 -0.0741333 -0.317343 -0.0586651 0.0456158 -0.0882346 -0.1056732 -0.0076 0.0426059 -0.0109572 0.1281166 0.5429599 0.0148286 -0.0715276 0.0189673 0.0398996 0.0075112 -0.073604 0.007224 -0.0895197 0.1273614 0.0679794 -0.0060743 0.1100505 -0.1864598 -0.0256854 -0.0017268 -0.0209301 0.0339178 1.9637658 0.4543025 -0.1616245 -0.1386484 1.5546958 0.1135694 -0.2029648 0.0463114 0.261355 0.9547891 -0.1906851 -0.0959635 0.4490506 1.8558224 0.0712188 -0.0481641 0.1422331 0.2346312 0.0042986 -0.2093715 -0.024766 0.0028907 -0.015372 0.0044725 -0.0140407 0.0290012 -0.098606 -0.0187142 -0.1109969 -0.0195159 0.0130137 0.1170862 0.0129916 -0.0103316 0.027203 -0.1232225 -0.2150789 0.1920264 0.0431989 0.1854782 -0.3593825 -0.0461614 0.0439241 -0.0466103 0.0587512 -0.111305 0.2135032 0.0106488 0.2679907 0.0900433 -0.017783 0.0127616 -0.0124797 -0.1284816 -0.1485228 0.0392414 0.0068095 -0.1391309 0.0793201 0.0267553 -0.0026202 0.0060372 -0.102062 0.068138 0.0179642 0.0528676 -0.0364788 0.0448993 -0.0253685 0.0568425 -0.0391902 0.0128857 0.0426526 0.0343699 -0.0546945 -0.0212296 0.035042 0.0335409 -0.0664459 0.0348796 0.0483776 0.0621851 0.0063706 0.0095293 0.0288936 -0.0177796 -0.0141897 0.0102655 -0.0108887 0.1377567 0.2563902 0.0111962 0.0125018 -0.0077369 0.142852 -0.0153154 0.0109514 -0.0174859 0.3606816 0.1460281 -0.0350649 -0.0011187 -0.0795502 0.0531386 0.003401 -0.0037932 -0.0015083 0.1488327 0.0568735 0.0999711 0.0170957 0.0656759 -0.0052859 -0.0167265 0.0150377 -0.020646 0.148949 0.0310618 -0.0743325 0.010144 -0.0796553 -0.0417381 -0.002586 0.0098999 -0.0031567 0.1564056 0.0576306 -0.0082173 0.0129093 0.0163014 0.1383063 -0.0040101 0.0145619 -0.0010112 0.1722482 unknown
polarizability: 245.6300776|16.1793007|179.4501999|-19.9583115|5.9644469|61.8365141 unknown
InChI: InChI=1S/C11H8N2O4/c14-10-6-8(11(15)12-10)4-7-2-1-3-9(5-7)13(16)17/h1-5,12H,6H2
charge 0 multiplicity 1
25 atoms
O  -3.846105 1.838395 0.396532
O  -3.743628 -2.849919 0.039708
O  4.569685 -1.348913 -0.764228
O  2.576702 -2.443967 -0.594048
N  -4.093005 -0.519218 0.251295
N  3.289136 -1.367847 -0.615694
C  -1.915364 0.300631 0.068322
C  -1.847094 -1.209816 -0.0478
C  -0.955501 1.273322 0.027553
C  0.497505 1.161435 -0.146719
C  -3.353503 0.691147 0.257691
C  -3.308328 -1.678268 0.078479
C  1.190181 -0.072046 -0.298688
C  1.264525 2.36658 -0.163944
C  2.587062 -0.062506 -0.459015
C  2.66445 2.349361 -0.326881
C  3.349381 1.125437 -0.477605
H  -1.439907 -1.563027 -1.013656
H  -1.248967 -1.690334 0.74908
H  -1.341491 2.297913 0.142488
H  -5.109392 -0.546935 0.361445
H  0.680676 -1.035909 -0.295141
H  0.744776 3.324708 -0.047422
H  3.224251 3.289498 -0.336299
H  4.433459 1.073276 -0.605353
