program: Gaussian 09
title: 000276791
version: EM64L-G09RevD.01
frameworkgroup: C1[X(C11H15NO5)]
method: RPBEPBE
basis: SDD
operation: Freq
keyword: #p
keyword: freq=noraman
keyword: PBEPBE/SDD
title: #p freq=noraman PBEPBE/SDD
converged: YES YES NO NO
title: Mulliken charges:
elementType: O O O O O N C C C C C C C C C C C H H H H H H H H H H H H H H H
charge: -0.442865 -0.272980 -0.274216 -0.473373 -0.201118 -0.558264 -0.248939 -0.271554 0.530832 -0.576166 -0.605362 0.377379 0.351284 0.174309 -0.520230 -0.535960 -0.534929 0.264925 0.283406 0.249726 0.289890 0.266032 0.284014 0.308730 0.371721 0.388406 0.223309 0.222611 0.244121 0.244452 0.227234 0.213578
chargesum: 0.00000
title: Mulliken charges with hydrogens summed into heavy atoms:
elementType: O O O O O N C C C C C C C C C C C
charge: -0.071145 -0.272980 -0.274216 -0.084967 -0.201118 0.034481 0.015985 0.011851 0.530832 -0.326441 -0.315472 0.377379 0.351284 0.174309 -0.254198 0.154081 0.150335
polarizability: 1.62318019e+02 1.03805770e+01 1.67430831e+02 -1.24803969e+01 4.03151114e+00 1.03516959e+02
1716.lowfreq: -7.1014 -5.2635 -0.0004 0.0006 0.0006 5.5020 23.1449 45.1148 66.7434
frequency: 22.8703 44.9790 66.7403 76.8653 90.1570 112.5233 139.2477 170.3991 189.2702 196.8348 207.3992 230.0069 237.9201 266.1686 269.9139 278.3955 289.0637 308.6935 389.4549 392.7176 426.2918 466.4401 480.1890 507.8160 520.6973 562.9455 587.0778 592.6929 606.0841 623.1020 644.8370 667.9863 691.7059 712.5256 801.7032 837.3834 853.7330 874.9725 884.6766 913.6851 964.3850 978.6692 993.8336 1009.1347 1030.6236 1045.6196 1111.8715 1113.1192 1116.7293 1140.1378 1154.4299 1158.7902 1166.0910 1182.3599 1208.0669 1214.9062 1263.7431 1290.2032 1296.7512 1325.3215 1355.6048 1389.8073 1401.1422 1427.4296 1438.7380 1455.2218 1462.0162 1465.2364 1465.9554 1475.2316 1478.2028 1601.5926 1612.1957 1644.0944 1679.5055 2958.5042 2960.2419 3022.3695 3045.9324 3048.3714 3067.4351 3123.7728 3124.8470 3160.3491 3173.5417 3179.9418 3452.1693 3460.3426 3500.3520 3584.2229
redmass: 5.4642 7.3865 6.9904 3.8314 3.3307 4.2213 4.4470 3.5846 2.2215 1.4799 2.2253 1.4967 3.4150 1.9900 2.0528 3.7664 4.6220 3.8782 4.0372 4.5829 5.2542 5.2619 2.5323 1.3348 5.2573 2.3219 3.4970 3.2578 4.1254 2.6714 3.0649 1.6447 2.5528 2.6555 3.4629 1.5508 1.8728 5.3319 1.5618 4.1628 4.9357 5.6560 4.7340 3.9522 3.4232 3.0131 1.2609 1.2604 1.3931 1.6602 1.6177 1.7285 1.6443 1.6533 1.3216 1.6274 1.2880 1.4862 3.2104 1.6953 1.3884 1.2979 4.7441 1.3053 1.3593 1.9405 1.9989 1.0504 1.0571 1.1225 1.2415 6.3160 6.9773 1.0929 9.0592 1.0330 1.0328 1.0836 1.1036 1.1040 1.0864 1.0995 1.0996 1.0919 1.0898 1.0913 1.0656 1.0463 1.0642 1.0971
irintensity: 0.3109 1.1191 4.2216 6.2088 5.1879 2.9083 1.1284 4.3256 3.7501 5.8525 43.5252 43.9400 6.4484 2.1123 8.6374 6.0445 4.7896 7.9620 0.8816 11.3744 18.5620 0.7500 48.6547 66.4367 12.1588 123.2304 40.9333 22.6981 12.2203 66.7094 74.2582 205.7402 10.3224 7.0059 16.8541 1.3645 45.4979 10.1320 20.4612 21.4492 28.1902 0.7682 15.2040 240.9455 92.2012 30.0747 0.0309 0.5760 18.5951 91.5503 45.9652 26.2980 95.2700 27.3778 2.7198 13.4832 6.0608 22.0248 102.0712 35.9250 7.2441 50.9961 29.2258 39.6213 2.1348 86.0839 34.8510 11.6993 14.5086 10.4930 26.7883 186.8110 156.7392 47.2627 202.7984 61.5884 59.9966 10.6319 44.3207 50.2452 12.0759 26.4263 24.1337 0.4289 4.2596 2.6236 77.9073 6.7615 10.1746 8.7578
temp: 298.150 k
press: 1.00000 atm
elementType: 8 8 8 8 8 7 6 6 6 6 6 6 6 6 6 6 6 1 1 1 1 1 1 1 1 1 1 1 1 1 1 1
symmnumber: 1
zpe: 659234.0 jmol-1
zpe.correction: 0.251089 hartree
zpe.thermalcorrener: 0.268970 hartree
zpe.thermalcorrenthalpy: 0.269914 hartree
zpe.thermalcorrgfe: 0.205017 hartree
zpe.sumelectzpe: -857.707624 hartree
zpe.sumelectthermal: -857.689742 hartree
zpe.sumelectthermalent: -857.688798 hartree
zpe.sumelectthermalfe: -857.753695 hartree
dipole: 0.3653 1.8441 2.1479
dipole: 2.8544
quadrupole: -83.1132 -87.3065 -112.8298
quadrupole: 4.9373 2.1942 1.2271
quadrupole: 11.3033 7.1100 -18.4133 4.9373 2.1942 1.2271
hfenergy: -857.9587127 hartree
pointgroup: C01 [X(C11H15N1O5)]
dipole: 0.2467636 -0.7646497 -0.7845865 debye
polarizability: 162.9754839|-9.8665154|165.8851264|15.5084834|0.485483|104.405199 unknown
InChI: InChI=1S/C11H15NO5/c1-16-7-3-6(4-8(5-7)17-2)10(13)9(12)11(14)15/h3-5,9-10,13-14H,12H2,1-2H3
charge 0 multiplicity 1
32 atoms
O  2.26871 -0.165543 2.101629
O  -3.035466 1.811528 -0.207082
O  -1.583846 -2.821846 -0.209897
O  3.365378 -0.726617 -0.353666
O  2.542886 0.549205 -2.112929
N  1.859005 2.702429 -0.313606
C  1.530373 0.839851 1.343715
C  2.440139 1.471873 0.211375
C  0.186332 0.336348 0.806763
C  -0.015691 -1.047418 0.566488
C  -0.843371 1.262704 0.546174
C  -2.080782 0.808604 0.01944
C  -1.258201 -1.480043 0.052504
C  2.758458 0.440091 -0.892909
C  -2.298137 -0.561023 -0.234932
C  -4.338478 1.398131 -0.733594
C  -0.569585 -3.833968 0.088923
H  1.354051 1.669166 2.048089
H  3.394261 1.709756 0.719556
H  0.769895 -1.756792 0.836723
H  -0.719405 2.327227 0.766281
H  -3.239417 -0.951776 -0.628762
H  2.531286 3.319567 -0.777456
H  1.022636 2.549247 -0.887355
H  2.783986 -0.729788 1.461991
H  3.548654 -1.378992 -1.083241
H  -4.852161 0.706582 -0.037812
H  -4.236584 0.916808 -1.725751
H  -4.917709 2.328211 -0.829083
H  -1.033169 -4.794243 -0.18107
H  -0.305513 -3.834935 1.164206
H  0.344965 -3.677841 -0.516508
