program: Gaussian 09
title: 000276797
version: EM64L-G09RevD.01
frameworkgroup: C1[X(C12H12N6O2)]
method: RPBEPBE
basis: SDD
operation: Freq
keyword: #p
keyword: freq=noraman
keyword: PBEPBE/SDD
title: #p freq=noraman PBEPBE/SDD
converged: YES YES NO NO
title: Mulliken charges:
elementType: O O N N N N N N C C C C C C C C C C C C H H H H H H H H H H H H
charge: -0.210488 -0.212987 0.010433 -0.314232 -0.187790 -0.596026 -0.624750 -0.632679 0.246365 0.427332 0.092978 0.173299 -0.473629 -0.370804 -0.340364 -0.433081 -0.247190 -0.244726 0.184377 0.244267 0.240112 0.277986 0.255719 0.242986 0.231321 0.230976 0.321571 0.334697 0.342736 0.310238 0.298365 0.422991
chargesum: 0.00000
title: Mulliken charges with hydrogens summed into heavy atoms:
elementType: O O N N N N N N C C C C C C C C C C C C
charge: -0.210488 -0.212987 0.010433 -0.314232 -0.187790 0.060242 0.028224 0.088677 0.246365 0.427332 0.092978 0.173299 -0.233517 -0.092818 -0.084645 -0.190096 -0.015869 -0.013749 0.184377 0.244267
polarizability: 3.36302780e+02 -1.23488876e+00 1.68655087e+02 3.03410576e+00 -2.52343738e+00 1.23421300e+02
1716.lowfreq: -0.0009 -0.0008 -0.0007 2.2997 8.6019 11.9072 21.5411 37.2333 47.9440
frequency: 21.2488 37.2252 47.8851 74.2305 88.2034 101.7188 132.1415 165.0895 181.8462 193.4497 209.7954 255.6469 274.8434 302.8037 311.6339 362.8960 384.7290 404.2385 430.0635 455.5605 460.9096 466.8263 493.8092 508.7348 522.3020 528.1459 546.2388 561.4482 592.5628 630.1670 651.2039 666.3466 684.2107 703.6273 709.7023 735.7692 741.5323 766.8865 792.3035 832.8527 841.4130 854.7504 878.8640 882.8293 936.5237 958.0157 980.1006 992.7016 994.5060 1014.4909 1035.3667 1074.3977 1085.2623 1140.5263 1159.1023 1174.7242 1179.1012 1212.6258 1236.2320 1255.9020 1289.9319 1319.3076 1356.3203 1392.4430 1404.2026 1420.6164 1432.6582 1455.3520 1482.4129 1500.5406 1527.9225 1556.9552 1568.4341 1595.6532 1605.0105 1615.8647 1626.6667 1648.4452 3078.0016 3123.9615 3127.9530 3139.1847 3160.6116 3163.3897 3181.6093 3525.9149 3561.8374 3613.3881 3675.4816 3716.6348
redmass: 5.2613 5.3026 5.0215 12.2998 4.8846 4.7977 4.8866 6.0359 4.6794 4.4795 7.1224 1.1667 5.9003 6.0111 3.9846 5.7499 4.1044 3.2219 3.2326 1.3472 1.3231 3.6868 3.6199 3.0695 5.5804 1.1917 3.2306 1.4670 3.4802 5.9121 4.9509 5.8921 7.5540 7.0624 6.6369 4.0853 4.6833 1.4866 3.9087 2.4298 2.7908 4.3909 1.2099 1.4552 4.5289 1.3490 1.3996 1.3546 4.1373 2.0319 2.2342 2.2786 1.7713 1.7716 1.3119 1.9827 1.1318 7.2578 1.8318 2.2219 2.5353 3.5641 5.9153 3.4427 4.5978 3.5359 3.5230 2.6230 2.0555 3.3149 2.6000 7.1443 3.6370 4.2142 1.6954 1.5395 4.9904 2.2579 1.0705 1.0874 1.0883 1.0902 1.0972 1.0963 1.0958 1.0446 1.0452 1.0853 1.1032 1.1052
irintensity: 3.1802 0.9193 2.8624 2.0925 0.7383 4.1136 2.2906 8.1963 11.8087 1.5521 0.8259 41.3458 1.8790 7.6546 10.2276 0.6191 4.3285 12.7495 3.0055 103.2075 282.3449 26.1470 11.8313 2.5804 3.5152 3.9278 17.2189 228.8264 20.8287 4.1996 6.4415 19.4730 16.1203 31.4507 8.3930 31.2588 37.9884 49.6536 9.3967 37.9512 34.8517 58.4836 95.6692 26.0060 8.1736 1.8199 2.2907 0.4217 1.9609 14.0559 5.5443 4.1204 1.1778 1.2856 2.2639 7.0327 15.6018 259.6100 12.6843 100.8332 157.3072 35.4146 88.3134 41.7767 57.6273 326.3708 45.1058 27.2904 161.1469 85.5960 154.1180 186.0935 1163.6661 116.8272 56.5150 474.7493 152.7908 779.7868 738.5674 0.4833 8.0703 16.9371 30.2687 10.9074 9.8114 45.9923 101.2309 44.1213 43.5790 39.0585
temp: 298.150 k
press: 1.00000 atm
elementType: 8 8 7 7 7 7 7 7 6 6 6 6 6 6 6 6 6 6 6 6 1 1 1 1 1 1 1 1 1 1 1 1
symmnumber: 1
zpe: 626753.3 jmol-1
zpe.correction: 0.238718 hartree
zpe.thermalcorrener: 0.256570 hartree
zpe.thermalcorrenthalpy: 0.257514 hartree
zpe.thermalcorrgfe: 0.191954 hartree
zpe.sumelectzpe: -941.967290 hartree
zpe.sumelectthermal: -941.949438 hartree
zpe.sumelectthermalent: -941.948494 hartree
zpe.sumelectthermalfe: -942.014054 hartree
dipole: 2.8780 -4.0102 -1.0946
dipole: 5.0560
quadrupole: -71.9288 -121.3645 -107.4886
quadrupole: 0.5269 -12.6749 3.7241
quadrupole: 28.3318 -21.1039 -7.2280 0.5269 -12.6749 3.7241
hfenergy: -942.206008 hartree
pointgroup: C01 [X(C12H12N6O2)]
dipole: 1.164344 -1.6081471 -0.1225083 debye
polarizability: 335.6640436|2.3969909|166.6851069|11.8808003|-9.472969|126.0300158 unknown
InChI: InChI=1S/C12H12N6O2/c13-11(14)17-12(15)16-9-6-5-7-3-1-2-4-8(7)10(9)18(19)20/h1-6H,13-15H2
charge 0 multiplicity 1
32 atoms
O  -0.748798 2.40096 -1.20017
O  0.570005 2.188298 0.645293
N  -0.277232 1.709135 -0.213245
N  1.675265 -0.414387 0.126929
N  3.916296 -0.095044 0.948848
N  2.126078 0.253777 2.37859
N  5.873766 -0.392316 -0.25384
N  3.805423 -0.706808 -1.372826
C  -2.111383 -0.011412 -0.122732
C  -2.496038 -1.379576 0.161399
C  -0.706711 0.317528 -0.030374
C  0.301006 -0.641697 0.259591
C  -1.480165 -2.342659 0.479852
C  -3.147437 0.932941 -0.429402
C  -0.137234 -1.993005 0.513567
C  -3.877628 -1.751348 0.126616
C  -4.48945 0.53885 -0.447322
C  -4.865577 -0.810753 -0.172231
C  2.537646 -0.091966 1.101763
C  4.492068 -0.401231 -0.226682
H  -1.782778 -3.375457 0.689963
H  -2.883428 1.96415 -0.67346
H  0.638639 -2.735719 0.723554
H  -4.145787 -2.792015 0.344406
H  -5.262849 1.277388 -0.685127
H  -5.921261 -1.100744 -0.196576
H  2.860678 0.535062 3.025805
H  1.191208 0.643676 2.49399
H  6.347429 -0.14177 0.610102
H  6.41027 -0.594498 -1.091933
H  4.260833 -0.897833 -2.26228
H  2.765847 -0.696727 -1.241768
