program: Gaussian 09
title: 000276778
version: EM64L-G09RevD.01
frameworkgroup: C1[X(C10H11NO2)]
method: RPBEPBE
basis: SDD
operation: Freq
keyword: #p
keyword: freq=noraman
keyword: PBEPBE/SDD
title: #p freq=noraman PBEPBE/SDD
converged: YES YES NO NO
title: Mulliken charges:
elementType: O O N C C C C C C C C C C H H H H H H H H H H H
charge: -0.407332 -0.247774 -0.048381 -0.229790 0.422867 -0.680084 -0.351739 -0.373715 -0.365812 0.170164 -0.225756 -0.219516 -0.229855 0.260913 0.244482 0.241750 0.222606 0.248562 0.231592 0.272871 0.229352 0.228526 0.230228 0.375839
chargesum: 0.00000
title: Mulliken charges with hydrogens summed into heavy atoms:
elementType: O O N C C C C C C C C C C
charge: -0.031493 -0.247774 -0.048381 0.031123 0.422867 0.028755 -0.103177 -0.142123 -0.092941 0.170164 0.003596 0.009010 0.000373
polarizability: 1.93545140e+02 6.86812009e+00 1.17385802e+02 -3.12155481e+00 -1.14441388e+01 7.14583438e+01
1716.lowfreq: -5.4046 -0.0011 -0.0009 0.0006 1.5486 3.8915 28.9374 33.1255 78.3566
frequency: 28.8850 33.1093 78.3463 91.6510 118.5957 162.2006 234.2681 245.9653 265.4194 312.5861 357.2544 400.8571 405.3301 486.2232 525.6154 590.9291 611.8839 614.3583 669.5255 700.0744 723.9951 770.5270 779.5840 854.8754 858.9437 886.8877 932.0805 987.2305 988.9220 993.3493 1007.9418 1015.6464 1023.7531 1028.5729 1076.1492 1083.1643 1118.7616 1171.9667 1180.6062 1235.7062 1237.6248 1289.7213 1312.5516 1355.8240 1375.7489 1382.8219 1400.2757 1441.1062 1462.1643 1474.1636 1482.1941 1584.2663 1609.0155 1622.4972 1647.3058 2983.7703 2996.0448 3047.3677 3100.1491 3110.2188 3119.4440 3129.0007 3142.9493 3157.4503 3167.7691 3492.8731
redmass: 3.7459 7.4579 4.2727 5.4594 3.7105 6.0252 1.8204 1.5242 2.8446 5.1651 4.8676 5.8074 2.8288 3.3688 3.5030 4.9646 1.4667 5.9478 2.9860 1.7977 4.7010 1.7606 2.9428 3.8670 1.2509 3.1870 1.3702 1.4094 5.9853 1.5239 1.3823 2.9203 2.1265 2.3354 1.7650 1.7467 1.9516 1.0666 1.1073 1.7323 2.0773 1.3067 1.4166 1.5567 2.0221 1.2808 2.4126 2.1480 1.0441 1.0571 2.3875 6.3147 6.0810 7.2218 7.0682 1.0878 1.0341 1.0852 1.1004 1.1013 1.0871 1.0872 1.0920 1.0959 1.1005 1.0638
irintensity: 0.6669 2.7572 0.6792 0.7654 6.7513 0.8058 2.5796 3.3940 8.8703 2.8857 1.6647 2.6003 0.0730 39.9264 12.5162 13.0675 123.6873 3.4292 26.4642 51.8963 20.8161 42.8466 17.2313 7.7757 0.0868 3.8947 0.3238 4.5365 0.6213 24.7820 11.0623 17.6368 4.4098 341.3044 40.6054 12.1029 14.3291 2.0424 6.1223 0.3542 35.3765 12.9933 13.2613 10.4235 0.6273 23.9945 3.5799 13.4786 17.0480 8.0103 3.9772 16.7210 21.2576 38.9655 165.8707 18.2244 25.7413 6.3309 27.8629 15.3169 5.5936 0.9209 22.8506 23.1596 23.5188 20.4556
temp: 298.150 k
press: 1.00000 atm
elementType: 8 8 7 6 6 6 6 6 6 6 6 6 6 1 1 1 1 1 1 1 1 1 1 1
symmnumber: 1
zpe: 495110.8 jmol-1
zpe.correction: 0.188578 hartree
zpe.thermalcorrener: 0.200988 hartree
zpe.thermalcorrenthalpy: 0.201933 hartree
zpe.thermalcorrgfe: 0.148111 hartree
zpe.sumelectzpe: -591.904059 hartree
zpe.sumelectthermal: -591.891648 hartree
zpe.sumelectthermalent: -591.890704 hartree
zpe.sumelectthermalfe: -591.944526 hartree
dipole: -0.0957 -0.3048 -0.4022
dipole: 0.5136
quadrupole: -61.2941 -71.0623 -81.0275
quadrupole: 0.0349 -2.1909 2.4109
quadrupole: 9.8339 0.0656 -9.8995 0.0349 -2.1909 2.4109
hfenergy: -592.0926369 hartree
pointgroup: C01 [X(C10H11N1O2)]
dipole: -0.03357 0.1705201 -0.1030957 debye
dipolederiv: -0.915584 -0.4166898 0.072177 -0.6168528 -0.7905078 0.1666377 0.2733324 0.1917242 -0.2610478 -0.4417326 -0.1784392 0.0442696 -0.2258525 -0.6165948 -0.0867447 0.0814676 -0.2943442 -0.7560884 -0.6479336 0.0323375 0.012925 -0.1058257 -0.3180858 -0.0053984 -0.2803001 0.0787138 -0.426293 0.3071446 -0.0333302 0.0730598 0.1094975 0.1176132 0.0823409 0.057167 0.0301611 0.0671058 -0.3021828 0.0399089 0.0323104 0.0569163 -0.0056063 -0.0238193 0.1237523 -0.0158416 -0.0548966 -0.0637515 0.0208108 0.0101711 -0.0297835 0.0341331 -0.0325114 0.1325376 0.0228745 0.0048879 1.0493058 -0.0951824 -0.0421336 -0.0803967 0.0085777 0.0853201 -0.0115631 0.0433867 0.3199392 0.0068693 -0.0366791 -0.1014519 -0.0006067 -0.1482933 0.0596726 0.0740032 0.0355016 0.0429382 -0.0223974 0.0152021 0.0942779 -0.0157867 -0.1171349 0.0148866 -0.0410553 0.031738 -0.0203846 0.7011145 0.699301 -0.2002506 0.9270811 0.9355918 -0.0212733 -0.5607267 0.1438203 0.9454503 -0.0246951 0.0230162 0.1466936 0.0361615 -0.1522262 0.0255894 0.1974052 0.0187938 0.0137275 -0.1377459 -0.0262106 -0.110052 -0.0345907 -0.1327907 0.0683941 -0.1492319 0.0756109 0.1066003 0.0666045 -0.0197564 -0.0130385 -0.0188303 -0.1444013 0.0339908 0.0030434 0.0322317 -0.0115436 -0.0609566 -0.0335434 -0.0326514 -0.0643998 -0.0141712 -0.0508532 0.0257103 -0.0512302 0.0398747 0.123304 -0.0150579 0.0927615 -0.0326239 0.0800426 0.0144736 0.0594611 0.0288141 -0.084478 0.0669467 -0.074908 -0.0467292 -0.0218023 -0.028419 -0.0340337 -0.0602113 -0.0949489 0.033637 -0.1926721 0.0516349 -0.0307874 0.0749407 0.0607879 0.0228186 -0.0166857 0.0157352 0.1057792 0.0522131 0.0153952 -0.0028803 0.0069275 0.1584891 -0.0520179 0.0376779 -0.0531323 -0.1025471 0.0721846 0.0276698 0.0886904 0.0198245 0.1394986 -0.0568511 0.0581664 -0.0529441 -0.0557388 0.0890629 -0.0174909 -0.0926731 -0.0149641 0.1467729 -0.0163258 -0.071963 -0.0212571 0.0299901 -0.0221537 -0.0055006 -0.0993828 -0.0118499 0.1530638 -0.0350659 -0.1207359 -0.0327041 -0.0312967 0.0393241 0.0257119 0.0632974 0.030889 0.1384191 -0.0607999 0.0899095 -0.0638825 -0.0831879 -0.1322821 0.0336967 0.0294538 0.0332776 0.1533926 -0.0184413 0.0319371 -0.0190877 0.0905454 0.3900132 -0.0318964 0.0119433 -0.02135 0.3418492 -0.0799886 0.0669021 -0.0497332 0.0870269 unknown
polarizability: 193.6631074|-8.626019|70.5584187|-1.0984818|7.8253077|118.16776 unknown
InChI: InChI=1S/C10H11NO2/c1-8(10(12)13)11-7-9-5-3-2-4-6-9/h2-8,12H,1H3
charge 0 multiplicity 1
24 atoms
O  3.88001 0.754409 -1.336379
O  2.560007 -1.004771 -2.083039
N  0.989914 -0.082716 0.505656
C  2.445503 -0.302327 0.306107
C  -1.332404 -0.013293 -0.208142
C  2.822214 -1.66278 0.94808
C  0.113982 -0.20443 -0.456133
C  -2.243958 -0.178047 -1.285327
C  -1.831809 0.328424 1.079323
C  2.936739 -0.265586 -1.142841
C  -3.630738 -0.005712 -1.082941
C  -3.215075 0.500436 1.279399
C  -4.119287 0.334056 0.199752
H  2.961589 0.505432 0.852729
H  2.423766 -1.694052 1.976159
H  2.384564 -2.493671 0.36907
H  3.918619 -1.789035 0.986381
H  0.390661 -0.462095 -1.498196
H  -1.861953 -0.443167 -2.279355
H  -1.114814 0.45244 1.897365
H  -4.326921 -0.135519 -1.918789
H  -3.595548 0.764026 2.272661
H  -5.195121 0.468668 0.359264
H  4.176159 0.754009 -2.288508
