program: Gaussian 09
title: 000276776
version: EM64L-G09RevD.01
frameworkgroup: C1[X(C10H8N4O2S)]
method: RPBEPBE
basis: SDD
operation: Freq
keyword: #p
keyword: freq=noraman
keyword: PBEPBE/SDD
title: #p freq=noraman PBEPBE/SDD
converged: YES YES NO NO
title: Mulliken charges:
elementType: S O O N N N N C C C C C C C C C C H H H H H H H H
charge: 0.952163 -0.533777 -0.533540 -0.408466 -0.717728 -0.003880 -0.009458 -0.073335 0.550507 -0.198718 -0.219835 -0.412976 -0.339344 -0.185851 0.258855 -0.228036 -0.263117 0.289350 0.287586 0.247503 0.242579 0.355429 0.339544 0.339568 0.264976
chargesum: 0.00000
title: Mulliken charges with hydrogens summed into heavy atoms:
elementType: S O O N N N N C C C C C C C C C C
charge: 0.952163 -0.533777 -0.533540 -0.053037 -0.038617 -0.003880 -0.009458 -0.073335 0.550507 0.090632 0.067751 -0.165473 -0.096764 0.079125 0.258855 -0.228036 -0.263117
polarizability: 3.33486623e+02 -7.96154001e+00 1.69610382e+02 -2.37822902e+00 2.91395950e-01 8.35853965e+01
1716.lowfreq: -2.3250 -0.0009 0.0015 0.0023 5.2494 6.4937 15.1999 32.7848 37.5943
frequency: 15.1618 32.7774 37.5814 54.1801 98.4768 102.5960 119.3594 123.8959 161.4813 192.0983 205.2497 214.0443 271.6523 291.7426 293.7558 334.8787 344.8769 371.8884 408.9809 414.7909 446.0075 462.1446 474.2643 532.9139 535.2731 583.8737 618.1609 622.8040 637.9576 729.7155 744.8159 781.9783 795.8373 806.6201 822.9564 846.5745 856.5541 908.6924 923.0692 966.4195 976.3881 988.9079 1062.2219 1072.0659 1127.4755 1181.2783 1191.8424 1230.4289 1299.1775 1333.8925 1343.7915 1371.6603 1415.2857 1477.0329 1488.1117 1535.2977 1599.9025 1604.6032 1642.4176 2156.8448 2177.3210 3134.6440 3155.1416 3167.9170 3172.6007 3195.7975 3368.5484 3469.8752 3535.6985
redmass: 8.3840 3.7557 7.5358 10.3187 6.7309 11.7646 1.5142 9.8154 6.6284 8.5380 7.3242 7.2768 2.3288 8.3229 3.0642 8.6200 7.0700 5.8422 2.8847 6.6344 9.6395 9.1481 3.6347 2.8741 5.8815 12.4332 5.7520 7.0688 6.8831 2.9283 1.5077 5.6903 2.7464 3.1621 1.3070 1.6907 4.4016 4.0290 1.3405 1.3841 1.3715 4.6893 2.6169 1.4878 1.3487 5.1346 1.1446 2.5769 1.3003 2.0163 2.1227 4.1753 4.0199 1.9480 2.8192 1.0847 6.8019 6.3008 3.2962 12.6048 12.6210 1.0906 1.0885 1.0955 1.0974 1.0928 1.0415 1.0759 1.1003
irintensity: 0.3611 1.3131 4.4746 4.9227 5.9571 2.3268 37.2304 0.4274 0.3696 2.0697 5.6851 2.3694 4.9285 2.5385 3.8822 34.2068 5.5199 3.5186 0.1949 11.0833 54.0026 0.6926 151.5338 89.7046 8.2182 2.4623 0.2879 0.3444 28.0860 7.8135 42.5410 17.0369 31.0121 256.3304 2.4860 84.5706 5.5011 57.9864 46.9601 1.4567 0.2113 1.0120 52.1084 27.5029 8.4196 3.1330 20.2787 6.9874 16.0190 409.5694 2.7591 3.8831 7.4788 56.4132 64.8267 18.8484 233.4479 108.5157 665.7596 50.7704 102.0120 6.6178 2.9025 1.7898 12.6406 5.8843 35.6839 24.1767 27.7668
temp: 298.150 k
press: 1.00000 atm
elementType: 16 8 8 7 7 7 7 6 6 6 6 6 6 6 6 6 6 1 1 1 1 1 1 1 1
symmnumber: 1
zpe: 440598.2 jmol-1
zpe.correction: 0.167815 hartree
zpe.thermalcorrener: 0.185087 hartree
zpe.thermalcorrenthalpy: 0.186032 hartree
zpe.thermalcorrgfe: 0.120060 hartree
zpe.sumelectzpe: -1151.955998 hartree
zpe.sumelectthermal: -1151.938726 hartree
zpe.sumelectthermalent: -1151.937782 hartree
zpe.sumelectthermalfe: -1152.003754 hartree
dipole: -3.6090 0.3246 2.8623
dipole: 4.6177
quadrupole: -160.3059 -112.4743 -109.8940
quadrupole: 2.5023 -18.5181 -0.9246
quadrupole: -32.7478 15.0838 17.6640 2.5023 -18.5181 -0.9246
hfenergy: -1152.1238135 hartree
pointgroup: C01 [X(C10H8N4O2S1)]
dipole: 1.4032307 0.1205787 -1.1475728 debye
dipolederiv: 2.6714432 -0.0794373 -0.2689188 -0.1463556 1.1860452 0.0332222 -0.2979247 0.0282113 1.5954805 -0.876011 -0.0465746 0.0071452 -0.110654 -0.5906219 -0.1736264 0.0441891 -0.0000078 -0.5404017 -0.8407457 0.0652284 0.0406062 0.1608208 -0.6118484 0.170753 0.0414787 -0.0044277 -0.5456134 -2.448119 -0.063407 0.0171457 -1.1781041 -0.1810885 0.0058422 0.0055381 -0.0001227 -0.2750298 -0.8233154 0.0326421 0.0790175 0.0492413 -0.3666957 -0.0169709 0.2406398 -0.0219825 -0.8972112 -0.4550156 -0.1025382 0.0020538 -0.3012419 -0.3164478 0.0021903 -0.0003414 -0.0003165 -0.2326986 -0.2678533 0.0112874 0.0007667 0.3514752 -0.3430157 -0.0025505 -0.000974 0.0007213 -0.2318879 -0.4446885 -0.0206925 -0.0381451 0.1394559 -0.2027219 0.0039561 -0.1861733 0.0117957 -0.1830532 2.1121212 -0.0577672 -0.0110699 -0.2841615 0.095583 0.0007689 0.0044424 -0.0005678 0.1129964 0.1323763 0.0741978 0.0126685 -0.2980997 0.0499429 -0.0009677 0.0245179 0.0185045 -0.0599695 -0.010906 -0.0365852 0.0148357 0.1808414 0.0294577 -0.0035467 0.0113444 -0.0229626 -0.0632885 -0.6535807 -0.0645836 0.0057067 -0.2556405 0.0356256 0.0014503 0.0161657 -0.0001517 -0.1736683 -0.4041249 0.0708682 0.0014716 0.377229 -0.0228714 -0.0070447 0.0096018 -0.0061717 -0.1620994 2.1689283 0.1025513 -0.0116992 1.1119409 0.0798073 -0.0066386 -0.0044164 -0.0003495 0.0405797 -1.1981134 -0.1026765 0.0087844 0.2837312 0.0030886 -0.0014886 -0.0034054 0.0002942 0.0371399 0.4621452 0.3445939 -0.0029147 0.6094001 0.1805965 -0.0032588 0.0000143 0.000116 0.0470319 0.0376699 -0.1527689 -0.0006136 -0.7139509 0.3398049 0.0040721 0.0010979 -0.0007786 0.0527985 0.117399 -0.0649696 -0.0057058 -0.0346604 0.0844978 0.005568 -0.001593 -0.0063726 0.1524267 0.1317645 0.0519254 -0.0074967 0.0229419 0.0640311 -0.0022157 -0.0004498 0.0082857 0.1509014 -0.0064422 0.0916696 0.0008845 0.0870178 -0.0109021 -0.0006384 -0.0061401 -0.0004383 0.1716622 -0.0110528 -0.085396 0.0036726 -0.1045824 0.0123932 0.0047442 -0.0019012 0.0049065 0.1673423 0.1392089 -0.0348656 -0.0004758 0.0361216 0.1463259 0.0012406 0.0027409 0.0005657 0.3153311 0.1566482 -0.0663408 0.0678903 -0.0070054 0.1602282 -0.1082589 0.0452012 -0.0565621 0.1824069 0.1716252 0.0636733 0.0855308 0.0064125 0.1466648 0.0936418 0.0548939 0.0473006 0.1769229 0.1386387 0.0699658 -0.0011404 0.0178268 0.0321207 -0.0002439 0.001453 0.0005107 0.1619012 unknown
polarizability: 333.4685217|6.6824582|169.4963517|-6.2277074|-0.0701968|83.7175275 unknown
InChI: InChI=1S/C10H8N4O2S/c11-5-8(6-12)7-14-9-1-3-10(4-2-9)17(13,15)16/h1-4,7,14H,13H2
charge 0 multiplicity 1
25 atoms
S  4.505278 -0.171215 0.043682
O  5.124681 1.221328 0.6178
O  4.830376 -1.6410 0.665846
N  -1.536611 0.503119 0.018606
N  4.952635 -0.248075 -1.739063
N  -5.668629 -2.083569 0.018649
N  -4.607142 2.37578 0.012495
C  2.640043 0.019768 0.015901
C  -0.132855 0.295817 0.019858
C  2.099334 1.315367 0.009221
C  1.849352 -1.139761 0.03828
C  0.699349 1.448497 0.011653
C  0.44868 -1.000905 0.040975
C  -2.519662 -0.449383 0.019878
C  -3.882949 -0.154191 0.017687
C  -4.856088 -1.204089 0.018325
C  -4.314808 1.213307 0.015117
H  2.755237 2.191116 0.027475
H  2.319617 -2.127285 0.078966
H  0.251428 2.449053 0.009816
H  -0.165937 -1.904812 0.064304
H  -1.845183 1.483062 0.015366
H  5.56899 0.554081 -1.951056
H  5.396384 -1.163891 -1.919748
H  -2.207821 -1.49542 0.021764
