program: Gaussian 09
title: 000276780
version: EM64L-G09RevD.01
frameworkgroup: C1[X(C10H12N6OS)]
method: RPBEPBE
basis: SDD
operation: Freq
keyword: #p
keyword: freq=noraman
keyword: PBEPBE/SDD
title: #p freq=noraman PBEPBE/SDD
converged: NO YES NO NO
title: Mulliken charges:
elementType: S O N N N N N N C C C C C C C C C C H H H H H H H H H H H H
charge: 0.212851 -0.267517 -0.175231 -0.227133 -0.180508 -0.624138 -0.623018 -0.631937 -0.356146 0.415092 -0.406821 0.325832 -0.332874 -0.348057 -0.218644 0.181338 -0.538429 0.245589 0.254256 0.247492 0.250379 0.244282 0.220527 0.220569 0.319706 0.404783 0.343890 0.311566 0.296089 0.436212
chargesum: 0.00000
title: Mulliken charges with hydrogens summed into heavy atoms:
elementType: S O N N N N N N C C C C C C C C C C
charge: 0.212851 -0.267517 -0.175231 -0.227133 -0.180508 0.100351 0.032438 0.100364 -0.356146 0.415092 -0.152565 0.325832 -0.085381 -0.097678 -0.218644 0.181338 0.146949 0.245589
polarizability: 3.81072425e+02 7.44873735e+00 1.81068018e+02 7.87880598e-03 1.35582275e-02 7.25130560e+01
1716.lowfreq: -0.0022 0.0014 0.0016 1.9000 4.1540 6.6412 35.1050 49.6081 74.0222
frequency: 35.1001 49.5892 74.0215 76.3185 105.9477 141.1784 167.1356 184.3338 184.4198 190.1556 235.8533 273.6516 276.3272 288.5443 323.7761 366.5485 403.2783 406.0780 424.7081 435.2240 471.3324 480.6402 503.1277 529.9231 536.0440 565.7756 588.8235 596.0419 613.7489 626.7245 673.4621 689.8871 714.6710 731.1974 771.5749 816.9189 818.8280 831.4065 835.5879 851.3812 906.2883 950.1680 958.6254 973.2032 993.4071 1024.7663 1034.9529 1096.3451 1112.2928 1118.1555 1156.3473 1175.1230 1198.5526 1200.0131 1262.9657 1289.3715 1364.7510 1407.9383 1420.1534 1436.0874 1459.7649 1466.2209 1474.6202 1475.6699 1479.3226 1503.1880 1528.4637 1566.8426 1590.9907 1608.3400 1612.1029 1646.0731 2953.2141 2967.9681 3039.0035 3122.4411 3153.0704 3168.6370 3175.0586 3246.0745 3559.0886 3606.9801 3631.2742 3714.2609
redmass: 6.9158 4.2822 5.5036 4.3175 4.4558 5.1762 4.8430 4.6679 4.4327 4.2325 1.7039 1.4577 5.7356 1.7868 3.7426 5.7946 6.9460 5.6376 3.9047 3.1866 1.2057 6.3443 3.2134 4.5963 1.1548 1.7784 2.3230 6.9004 3.6863 7.2525 7.1038 8.9110 6.6054 4.1446 7.1366 1.3908 7.3040 1.3455 1.3007 6.0727 7.9082 1.3434 1.0841 3.7347 5.3161 1.6612 2.7030 1.6748 1.2609 1.2902 1.3712 5.4007 2.0548 2.6355 1.6265 4.1405 4.8834 3.1640 2.5897 1.6157 2.2464 1.0500 2.2106 1.1237 3.0747 4.7936 3.0421 5.5838 1.6678 1.9952 4.3369 1.9931 1.0333 1.0739 1.1038 1.0989 1.0879 1.0913 1.0972 1.0649 1.0452 1.0840 1.0889 1.1052
irintensity: 3.9919 0.0186 1.0182 0.1782 2.4889 16.8500 10.3826 2.4531 1.4696 2.6478 0.5086 11.1150 6.4829 25.6867 29.7633 1.4799 0.0004 0.3579 5.4050 4.7441 395.4107 4.2507 0.6852 2.0461 8.2201 127.3649 31.1971 23.4100 57.8889 63.1190 0.7982 0.2688 4.4938 0.0716 15.9385 2.7285 43.7283 1.1580 175.4662 21.6023 21.2199 0.1071 138.4019 18.0970 81.9378 6.5162 18.9124 14.6257 0.1906 12.5124 3.6998 115.4027 1.3836 295.4813 64.2169 32.0138 8.5376 171.7479 20.1808 123.1488 557.0431 13.0639 327.6292 5.4794 49.9544 1510.6738 111.4216 92.8892 216.3682 258.9714 411.1307 1058.9838 81.9299 634.9729 51.8893 30.6735 5.0390 7.5434 9.9331 209.8036 125.6259 43.9302 88.3144 39.3435
temp: 298.150 k
press: 1.00000 atm
elementType: 16 8 7 7 7 7 7 7 6 6 6 6 6 6 6 6 6 6 1 1 1 1 1 1 1 1 1 1 1 1
symmnumber: 1
zpe: 590461.6 jmol-1
zpe.correction: 0.224895 hartree
zpe.thermalcorrener: 0.241829 hartree
zpe.thermalcorrenthalpy: 0.242773 hartree
zpe.thermalcorrgfe: 0.180111 hartree
zpe.sumelectzpe: -1188.786799 hartree
zpe.sumelectthermal: -1188.769865 hartree
zpe.sumelectthermalent: -1188.768921 hartree
zpe.sumelectthermalfe: -1188.831583 hartree
dipole: -4.0929 -2.7791 0.0245
dipole: 4.9473
quadrupole: -64.2285 -94.9258 -119.5575
quadrupole: 1.2381 -0.0633 -0.0007
quadrupole: 28.6754 -2.0219 -26.6536 1.2381 -0.0633 -0.0007
hfenergy: -1189.011694 hartree
pointgroup: C01 [X(C10H12N6O1S1)]
dipole: -1.630236 -0.8564733 -0.6303498 debye
polarizability: 380.846354|-3.4386136|147.7437351|11.6762717|49.7644903|106.0634097 unknown
InChI: InChI=1S/C10H12N6OS/c1-17-5-2-3-6-7(4-5)18-10(14-6)16-9(13)15-8(11)12/h2-4H,11-13H2,1H3
charge 0 multiplicity 1
30 atoms
S  0.248679 -1.229481 -0.93629
O  5.433438 -0.14427 0.020716
N  -0.056773 1.015845 0.540626
N  -2.138813 -0.009749 -0.234796
N  -4.360851 0.826431 0.220063
N  -2.518417 1.965838 1.063423
N  -6.341432 -0.127533 -0.50285
N  -4.298772 -1.180878 -1.103576
C  1.71262 -0.373559 -0.301899
C  1.325337 0.782754 0.448471
C  3.061899 -0.736119 -0.481561
C  4.049244 0.089515 0.111671
C  2.336185 1.589001 1.029411
C  3.6861 1.243386 0.860984
C  -0.786333 0.094525 -0.103385
C  -2.988792 0.906539 0.336163
C  5.870789 -1.317766 -0.735027
C  -4.961406 -0.168356 -0.46689
H  3.329694 -1.624112 -1.059406
H  2.051237 2.474847 1.604845
H  4.486658 1.847197 1.298356
H  6.969043 -1.30677 -0.674323
H  5.555803 -1.255904 -1.795707
H  5.482277 -2.254133 -0.287507
H  -3.193893 2.612764 1.464451
H  -1.490501 2.05089 1.168246
H  -6.78944 0.642625 -0.012683
H  -6.901948 -0.823399 -0.985574
H  -4.773804 -1.921917 -1.614284
H  -3.250726 -1.098708 -1.002066
