program: Gaussian 09
title: 000276855
version: EM64L-G09RevD.01
frameworkgroup: C1[X(C29H18O6)]
method: RPBEPBE
basis: SDD
operation: Freq
keyword: #pfreq=noraman
keyword: PBEPBE/SDD
title: #p freq=noraman PBEPBE/SDD
converged: YES YES NO NO
title: Mulliken charges:
elementType: O O O O O O C C C C C C C C C C C C C C C C C C C C C C C C C C C C C H H H H H H H H H H H H H H H H H H
charge: -0.432035 -0.525423 -0.154439 -0.112169 -0.137700 -0.121042 -0.510627 0.226411 0.266697 0.008698 0.086668 -0.097174 0.346595 0.438277 -0.137956 -0.177714 0.275709 0.265537 -0.199146 -0.234596 -0.364780 -0.386141 -0.371917 -0.374834 -0.372072 -0.224122 -0.253328 -0.234050 -0.232177 0.488771 -0.403527 -0.401180 -0.236953 -0.239597 -0.244695 0.324095 0.223518 0.232766 0.288738 0.191852 0.291501 0.298676 0.236562 0.244185 0.240883 0.250828 0.429673 0.386591 0.220634 0.234163 0.223617 0.228137 0.229612
chargesum: 0.00000
title: Mulliken charges with hydrogens summed into heavy atoms:
elementType: O O O O O O C C C C C C C C C C C C C C C C C C C C C C C C C C C C C
charge: -0.002363 -0.138831 -0.154439 -0.112169 -0.137700 -0.121042 -0.186532 0.226411 0.266697 0.008698 0.086668 0.126343 0.346595 0.438277 -0.137956 -0.177714 0.275709 0.265537 -0.199146 -0.234596 -0.132014 -0.097403 -0.180065 -0.083333 -0.073396 0.012441 -0.009143 0.006832 0.018650 0.488771 -0.182892 -0.167017 -0.013335 -0.011460 -0.015083
polarizability: 4.10264860e+02 -8.09314807e-01 3.68678949e+02 1.48764664e+01 2.22115438e+01 3.52539101e+02
1716.lowfreq: -0.0009 -0.0008 0.0001 1.6954 4.9855 6.1170 8.0864 22.0757 24.1577
frequency: 7.6749 22.0042 24.1298 24.9313 27.5115 43.0021 44.3093 68.5024 74.1213 82.8702 100.5060 130.5386 137.5621 144.3242 155.6435 168.6829 189.7495 192.8101 229.0822 264.2199 276.9824 279.9561 289.6840 311.9154 320.0942 353.9815 363.7500 365.7126 370.9383 373.9626 396.2587 403.5238 405.2828 412.0567 425.0617 438.7438 445.7909 456.3190 464.8737 485.1855 490.0617 519.7033 536.0712 558.7579 573.8950 588.0300 616.7578 627.6560 631.2125 648.2477 657.9434 676.2474 690.2717 693.9855 700.0597 714.1794 731.5799 738.3918 765.8418 771.2119 791.5708 824.0206 832.6169 844.4111 847.3096 848.9773 855.1908 860.9305 866.5329 895.5964 918.2753 922.1075 928.6404 951.0685 958.6915 973.4306 973.6129 977.1943 988.4181 990.6891 996.8754 999.8301 1010.0929 1010.2263 1026.7342 1040.4252 1043.1980 1071.3488 1081.4842 1084.4299 1110.8605 1119.8427 1151.1669 1172.6743 1173.3098 1178.3591 1190.9379 1193.3802 1208.5794 1212.7696 1226.5265 1235.4603 1246.4709 1249.2046 1263.7385 1282.0445 1287.8391 1305.5868 1313.6766 1332.1021 1344.2765 1368.5251 1389.1544 1391.1737 1395.4495 1413.9600 1438.0064 1439.8511 1440.6897 1481.8160 1483.2556 1485.4001 1529.8575 1547.3033 1568.1443 1573.0663 1579.5222 1583.9170 1584.2078 1598.6821 1612.2644 1615.1025 1616.0894 1627.9098 1652.7187 2971.0075 3088.3634 3100.5912 3119.4258 3120.0588 3124.6118 3137.1523 3137.4508 3147.3023 3147.4470 3151.7919 3158.4103 3162.6487 3164.4523 3166.5129 3175.2179 3183.6230 3600.2268
redmass: 5.2494 6.5235 6.4501 6.9320 5.3372 8.2542 8.8197 7.9861 4.2222 6.7222 4.4037 4.8803 5.8312 5.3032 6.8192 7.4675 6.9797 5.6831 2.4157 2.0823 4.1724 3.8463 3.5084 5.8718 6.5960 6.3876 9.8547 8.2093 8.9392 7.5379 7.4106 2.8034 4.9622 4.4903 7.6775 4.5550 5.1435 5.0314 7.2515 6.3310 4.6843 4.6534 5.8193 5.3070 5.3185 5.6239 6.4255 6.4155 5.6023 6.1834 6.0655 5.2875 4.4689 3.5813 2.2041 3.7604 3.8405 5.1254 1.8451 1.5176 1.5043 5.4018 1.6196 1.6510 2.9857 1.8569 3.5549 2.2943 2.2790 2.7002 2.5847 1.8588 1.9514 6.1859 7.5814 1.2079 1.4083 1.3681 5.9550 1.3981 1.3668 4.9958 1.3879 1.3637 2.1921 2.0310 2.3031 3.8049 1.8317 2.6560 3.3865 2.2215 2.8295 1.0599 1.0964 1.2163 1.1184 1.5085 2.3418 2.6696 2.0105 2.1353 2.6108 1.9902 2.7485 1.9125 1.7199 2.3751 1.4050 1.3194 1.4680 1.7836 3.9177 7.2826 10.1362 1.7972 2.3506 2.4322 2.2596 2.5635 2.8574 2.3016 12.3449 12.8172 8.4542 7.9544 8.2136 6.3359 6.3367 7.6685 5.9935 8.1214 8.2495 7.6626 5.9244 1.0812 1.0908 1.0886 1.0876 1.0869 1.0870 1.0864 1.0912 1.0961 1.0879 1.0912 1.0932 1.0727 1.1015 1.0972 1.1005 1.0959 1.0658
irintensity: 0.9220 0.8772 0.0907 1.0233 1.0428 0.8736 0.3631 0.0685 0.8291 1.8725 6.2006 0.4921 2.4302 1.7003 4.4198 0.2380 1.0709 3.2675 1.1039 39.9686 8.4312 17.5683 37.6341 3.4511 4.3878 3.3785 4.2053 4.1338 4.4716 6.2398 2.3253 0.0234 1.8195 0.8362 1.9271 20.6525 7.9311 3.1070 3.8641 2.6449 10.9393 0.2504 1.0331 7.2209 12.5118 0.2972 0.0062 0.6952 6.1349 10.1106 9.0678 7.1114 31.1963 18.8204 18.6828 7.4561 14.1270 1.8625 85.5835 79.4758 31.5908 2.1531 72.8669 36.6469 45.0412 16.7403 73.7869 6.0976 2.3905 5.1915 7.6445 3.0066 0.0874 18.0324 16.4174 32.6685 3.7843 8.3151 0.3007 4.5128 5.4015 5.6164 1.0603 0.0394 6.2266 2.1107 13.8886 21.8847 13.9652 9.1089 7.4550 11.2908 15.4933 0.1743 12.5899 30.9933 1.2560 72.0467 1.6993 18.6312 3.3786 20.4007 45.9963 126.7290 24.8868 28.2878 45.6497 125.5329 21.8280 7.6403 35.3676 11.4014 3.0281 6.0404 6.0133 9.9484 6.9881 12.3636 10.1518 29.3594 28.7792 18.7703 165.8848 287.1860 16.5597 1.4120 111.9483 18.2768 15.4871 9.8540 7.0606 37.0392 7.2094 8.1117 0.8103 28.5916 8.9275 30.5486 21.8250 2.4300 4.8692 3.7064 7.7916 41.8180 6.0953 9.0546 2.5325 719.8178 30.8475 6.9394 16.9293 6.9759 51.2930
temp: 298.150 k
press: 1.00000 atm
elementType: 8 8 8 8 8 8 6 6 6 6 6 6 6 6 6 6 6 6 6 6 6 6 6 6 6 6 6 6 6 6 6 6 6 6 6 1 1 1 1 1 1 1 1 1 1 1 1 1 1 1 1 1 1
symmnumber: 1
zpe: 1017947.0 jmol-1
zpe.correction: 0.387716 hartree
zpe.thermalcorrener: 0.416511 hartree
zpe.thermalcorrenthalpy: 0.417456 hartree
zpe.thermalcorrgfe: 0.324188 hartree
zpe.sumelectzpe: -1564.811565 hartree
zpe.sumelectthermal: -1564.782769 hartree
zpe.sumelectthermalent: -1564.781825 hartree
zpe.sumelectthermalfe: -1564.875092 hartree
dipole: -6.2117 -1.5472 -12.1858
dipole: 13.7649
quadrupole: -172.7755 -187.5318 -209.9960
quadrupole: 0.7269 -4.9999 14.8379
quadrupole: 17.3256 2.5693 -19.8949 0.7269 -4.9999 14.8379
hfenergy: -1565.1992805 hartree
pointgroup: C01 [X(C29H18O6)]
dipole: -1.5132043 -0.8655104 5.1273006 debye
polarizability: 378.3292289|16.0342297|394.5073591|-31.6102156|-4.8489068|358.6463216 unknown
InChI: InChI=1S/C29H18O6/c30-24-17-10-4-6-12-19(17)26(32)28(34)22(24)21(15-14-16-8-2-1-3-9-16)23-25(31)18-11-5-7-13-20(18)27(33)29(23)35/h1-15,21,30-31H
charge 0 multiplicity 1
53 atoms
O  0.47271 1.684631 1.664498
O  -0.819704 -0.599701 1.938373
O  1.605112 0.879718 -2.97318
O  -1.758337 0.14881 -2.681537
O  2.519722 3.515828 -3.15962
O  -4.48507 -0.258876 -2.232719
C  0.284204 -0.214558 -0.730015
C  0.86194 1.212528 -0.709944
C  -1.210308 -0.30532 -0.381458
C  0.929865 2.034349 0.411047
C  -1.738745 -0.567699 0.866216
C  1.193099 -1.197076 0.00293
C  1.518229 3.392879 0.386412
C  -3.167727 -0.763808 1.174165
C  1.495768 1.647043 -1.968828
C  -2.153313 -0.140235 -1.517255
C  2.064084 3.913728 -0.823033
C  -4.121246 -0.677464 0.114789
C  2.069017 3.087146 -2.062546
C  -3.676026 -0.355187 -1.271739
C  1.630057 -2.350757 -0.577149
C  1.537916 4.193197 1.555212
C  -3.636379 -1.03616 2.485879
C  2.613667 5.217587 -0.85072
C  -5.496788 -0.877803 0.371827
C  2.089952 5.492361 1.518853
C  -5.011313 -1.242661 2.733569
C  2.62843 6.009432 0.315814
C  -5.947373 -1.166628 1.676375
C  2.533364 -3.358606 0.015278
C  3.118645 -3.223015 1.307915
C  2.84295 -4.52601 -0.738605
C  3.973749 -4.217479 1.822355
C  3.698184 -5.523642 -0.224296
C  4.267993 -5.375212 1.060861
H  0.32769 -0.478788 -1.80651
H  1.525434 -0.930552 1.013483
H  1.28713 -2.570487 -1.599537
H  1.118759 3.787594 2.47894
H  -2.956912 -1.084971 3.347235
H  3.023709 5.583349 -1.797771
H  -6.192316 -0.798024 -0.469956
H  2.100026 6.102609 2.428443
H  -5.3508 -1.455798 3.752295
H  3.055014 7.017559 0.292093
H  -7.012352 -1.324463 1.872072
H  0.080248 0.758045 1.750963
H  -1.174732 -1.009562 2.762877
H  2.914329 -2.33054 1.910278
H  2.408795 -4.644084 -1.739234
H  4.418446 -4.091819 2.816319
H  3.922488 -6.411925 -0.82528
H  4.935115 -6.145682 1.46287
