program: Gaussian 09
title: 000276764
version: EM64L-G09RevD.01
frameworkgroup: C1[X(C8H11N5O)]
method: RPBEPBE
basis: SDD
operation: Freq
keyword: #p
keyword: freq=noraman
keyword: PBEPBE/SDD
title: #p freq=noraman PBEPBE/SDD
converged: YES YES NO NO
title: Mulliken charges:
elementType: O N N N N N C C C C C C C C H H H H H H H H H H H
charge: -0.440820 -0.337982 -0.204316 -0.636937 -0.627369 -0.639878 0.296440 -0.372355 -0.372721 0.268179 -0.363053 -0.340089 0.186159 0.244076 0.242915 0.265460 0.213762 0.245862 0.348436 0.325496 0.338275 0.336969 0.306242 0.287123 0.430125
chargesum: 0.00000
title: Mulliken charges with hydrogens summed into heavy atoms:
elementType: O N N N N N C C C C C C C C
charge: -0.092384 -0.337982 -0.204316 0.026834 0.015842 0.077371 0.296440 -0.129440 -0.107261 0.268179 -0.149291 -0.094228 0.186159 0.244076
polarizability: 2.33628394e+02 -2.85769958e-01 1.21405192e+02 3.08101770e+00 7.68945436e+00 7.17378252e+01
1716.lowfreq: -9.1015 -5.9609 0.0003 0.0004 0.0008 3.9210 38.2880 49.3814 75.4223
frequency: 38.1890 49.3791 75.4191 115.0250 149.2197 179.7207 216.9203 248.3903 315.2355 330.0089 331.2542 366.0888 406.9345 408.7845 433.6053 439.7168 455.9591 476.3634 506.6802 522.5035 532.9113 551.8820 633.9184 662.3369 681.7991 707.7127 711.0584 774.9368 801.6460 815.3030 838.2663 878.1146 923.9505 952.3695 978.1003 993.9403 997.1420 1034.1275 1084.0262 1093.1135 1143.0906 1167.8334 1170.2932 1231.8628 1259.6900 1296.2725 1366.7427 1402.4968 1426.0255 1437.0423 1493.5803 1513.3802 1544.2321 1579.9813 1596.2718 1602.2438 1623.0227 1649.4694 2808.0647 3108.1276 3134.3641 3154.5269 3164.4665 3547.8120 3563.0951 3584.7605 3598.2752 3704.5537 3719.2180
redmass: 4.1926 5.7436 4.8434 4.7013 5.3348 4.0134 4.0377 1.3451 4.2610 1.2471 2.8782 4.9181 3.1609 2.5109 2.0089 1.7075 1.2445 4.0097 2.1488 1.1647 1.2511 3.4554 6.8761 5.0674 8.6136 6.4053 4.8288 4.2648 1.6318 2.4233 2.0730 4.3781 1.3614 1.3171 1.0847 2.9796 2.3004 1.8836 1.7546 1.3987 1.3833 1.1973 1.6319 2.1484 4.7106 1.4426 3.7810 2.9197 3.2838 2.2650 2.7545 3.2822 3.2105 5.6936 1.3856 1.7555 4.6142 2.3282 1.0787 1.0893 1.0883 1.0944 1.0961 1.0439 1.0450 1.0660 1.0826 1.1053 1.1052
irintensity: 1.2018 1.8648 0.5421 2.0383 6.0083 2.5786 11.3827 62.6835 19.7656 108.3329 34.7559 7.4693 6.1862 19.0481 6.9314 8.7692 625.3513 2.7006 23.1520 6.1521 37.1635 11.2744 0.6437 3.8399 8.4484 16.2818 3.2823 57.9494 26.5061 3.1208 47.1934 10.9287 0.7307 2.6557 118.8207 5.0688 12.7501 0.3068 10.2024 55.3556 267.1508 1.2530 0.1315 115.6164 54.7680 26.3479 16.1654 170.0290 33.4198 272.2784 388.2934 5.6509 648.1329 11.2856 218.9372 358.4560 77.9907 1047.7055 737.8696 28.0718 9.2284 14.5676 5.5556 42.7279 86.2436 40.8153 23.3519 46.3256 35.3984
temp: 298.150 k
press: 1.00000 atm
elementType: 8 7 7 7 7 7 6 6 6 6 6 6 6 6 1 1 1 1 1 1 1 1 1 1 1
symmnumber: 1
zpe: 510224.3 jmol-1
zpe.correction: 0.194334 hartree
zpe.thermalcorrener: 0.208020 hartree
zpe.thermalcorrenthalpy: 0.208964 hartree
zpe.thermalcorrgfe: 0.153903 hartree
zpe.sumelectzpe: -659.424629 hartree
zpe.sumelectthermal: -659.410943 hartree
zpe.sumelectthermalent: -659.409998 hartree
zpe.sumelectthermalfe: -659.465060 hartree
dipole: 3.1617 -1.8158 -0.7423
dipole: 3.7208
quadrupole: -58.3337 -68.5929 -85.0806
quadrupole: -0.8310 8.8948 -0.7039
quadrupole: 12.3354 2.0762 -14.4115 -0.8310 8.8948 -0.7039
hfenergy: -659.6189627 hartree
pointgroup: C01 [X(C8H11N5O1)]
dipole: 1.2608569 -0.2888156 0.6853999 debye
dipolederiv: -1.7664749 0.0208448 0.0894602 0.0329728 -0.3018839 -0.1773607 0.0387749 -0.1745008 -0.1800118 -2.1975404 -0.0182839 0.2089529 -0.1655125 -0.3377295 -0.0777847 0.4792408 -0.0918521 -0.7144596 -2.1294878 -0.2393822 -0.4537846 -0.3401952 -0.4524992 -0.200721 -0.8884517 -0.2284089 -0.9155904 -0.4532446 -0.089089 -0.3614842 0.0025359 -0.686286 -0.1415349 0.0830321 -0.1869292 -1.1815097 -1.7945775 -0.0698445 -0.0253211 -0.1096045 -0.713632 0.1230373 -0.052168 0.1186649 -0.2684296 -0.8008934 0.0377655 0.1318729 -0.0290697 -0.6312483 -0.0970835 -0.2015407 -0.120611 -0.9845905 1.5329474 -0.0152921 -0.1614479 0.0984633 -0.0017945 0.0257079 -0.0857 0.0212692 -0.0702225 -0.2125484 0.0750268 -0.0905593 -0.1672272 -0.0690166 -0.1086535 0.2248426 -0.1215381 0.005544 -0.2146947 -0.0720778 0.1395325 0.1598772 -0.0661803 -0.1419394 -0.1680291 -0.1164335 -0.0404079 1.511199 -0.0137107 -0.0952323 -0.0088878 0.0056003 0.0593236 -0.0835884 0.0438039 -0.0240477 -0.2298971 -0.0574274 0.1009014 0.2084505 -0.1163714 -0.1479752 -0.2163963 -0.1116846 -0.0172248 -0.2002806 0.0662652 -0.0876918 -0.1695586 -0.0725305 -0.1102931 0.2256664 -0.1285604 0.0028556 2.3944899 0.2352423 0.3571303 0.1364554 0.3415774 0.3788808 -0.6332084 0.408098 1.4600318 2.3404486 0.1543763 0.0527791 0.4549976 0.3753095 0.3116112 0.9684477 0.3867433 1.4040596 0.0519787 0.0558354 -0.0788214 0.0403417 0.0823085 0.0895041 -0.0746317 0.0923642 0.0315446 0.0471821 -0.0556714 0.0712021 -0.0632222 0.081543 0.0792322 0.0576854 0.0868281 0.0322389 -0.048567 -0.0607992 0.1030716 -0.0662836 0.0975959 0.1053865 0.104493 0.1060373 0.0100611 0.0172399 0.0546398 -0.056031 0.0616311 0.0940654 0.0911524 -0.0741771 0.0951217 0.0451558 0.4215177 0.0080141 -0.0170906 -0.0157777 0.2671137 0.1596971 0.0194841 0.1609674 0.1543884 0.1860093 -0.0045205 0.020005 -0.0042425 0.3546408 -0.0625196 0.0218277 -0.0433626 0.2595539 0.1602976 -0.0178661 -0.0055011 -0.0747535 0.318717 0.0034918 -0.0433165 -0.016123 0.2413216 0.2695443 -0.0159629 -0.0218206 -0.0281859 0.376569 -0.0571437 -0.0422532 -0.0587572 0.1825245 0.2217163 -0.0138744 0.0032758 -0.0024089 0.3730329 -0.0641551 0.0131279 -0.0660919 0.1382108 0.0613167 -0.0470946 -0.0816705 -0.0663949 0.3594958 -0.0721778 -0.0619397 -0.0712491 0.1394008 0.8323189 0.0828866 0.2582724 0.1155992 0.3216028 0.0323174 0.3887782 0.0162043 0.2896028 unknown
polarizability: 233.5256004|4.4412388|72.0032985|-1.8757341|-8.3741551|121.2425121 unknown
InChI: InChI=1S/C8H11N5O/c9-7(10)13-8(11)12-5-1-3-6(14)4-2-5/h1-4,14H,9-11H2
charge 0 multiplicity 1
25 atoms
O  -4.90773 0.261738 0.039255
N  0.771559 0.063194 0.059746
N  2.944639 -0.067684 -0.97783
N  1.083244 -0.551773 -2.254706
N  4.964384 0.376555 0.073635
N  2.955389 0.55984 1.337121
C  -0.646388 0.075398 -0.001052
C  -1.380921 -0.60004 1.013218
C  -1.385179 0.818041 -0.974094
C  -3.498762 0.173973 0.066209
C  -2.790267 -0.556424 1.050208
C  -2.792729 0.867004 -0.942504
C  1.556353 -0.164458 -1.007849
C  3.584731 0.289475 0.151772
H  -0.825358 -1.161396 1.771628
H  -0.845435 1.391811 -1.73605
H  -3.332081 -1.089991 1.843084
H  -3.356593 1.445303 -1.681235
H  -5.299978 -0.25174 0.788027
H  1.772086 -0.756178 -2.973523
H  0.095712 -0.738165 -2.40847
H  5.387573 0.16539 -0.826079
H  5.544492 0.631354 0.866781
H  3.453867 0.835259 2.180754
H  1.897291 0.453114 1.244154
