program: Gaussian 09
title: 000276760
version: EM64L-G09RevD.01
frameworkgroup: C1[X(C6H9N7)]
method: RPBEPBE
basis: SDD
operation: Freq
keyword: #p
keyword: freq=noraman
keyword: PBEPBE/SDD
title: #p freq=noraman PBEPBE/SDD
converged: YES YES NO NO
title: Mulliken charges:
elementType: N N N N N N N C C C C C C H H H H H H H H H
charge: -0.324746 -0.171799 -0.186714 0.011038 -0.623452 -0.622623 -0.633312 0.227382 0.193612 -0.389951 0.247748 -0.260275 -0.279874 0.239485 0.234281 0.239759 0.315187 0.406557 0.342632 0.310787 0.293159 0.431120
chargesum: 0.00000
title: Mulliken charges with hydrogens summed into heavy atoms:
elementType: N N N N N N N C C C C C C
charge: -0.324746 -0.171799 -0.186714 0.011038 0.098291 0.030796 0.090967 0.227382 0.193612 -0.150465 0.247748 -0.025995 -0.040115
polarizability: 2.26332221e+02 4.04362821e+00 1.25137502e+02 3.12501521e-02 1.26095504e-03 4.75831639e+01
1716.lowfreq: -7.1449 -4.9694 -0.0009 -0.0004 0.0002 4.5737 59.8377 70.0805 117.6414
frequency: 59.8319 70.0683 117.6367 118.9249 168.1522 240.7824 251.8589 287.9259 324.5617 354.0815 420.6203 434.6490 471.3961 504.4644 530.8868 537.9963 589.5956 592.6826 621.9254 691.2201 722.2323 727.5500 747.4665 830.1882 838.7421 886.6531 886.7440 904.1022 936.9509 965.8539 995.4585 998.9734 1030.3631 1053.9027 1103.9331 1153.2582 1199.3428 1250.4455 1276.5326 1308.0606 1372.6662 1428.0441 1440.3904 1464.1839 1471.5989 1483.7930 1524.1016 1538.8406 1577.1672 1606.7688 1648.1819 2857.7632 3128.4484 3137.5547 3166.8190 3185.4685 3559.2321 3600.5452 3622.4199 3714.7295
redmass: 4.6967 4.7151 4.9918 5.5046 4.8302 5.1750 3.6159 1.1983 4.3539 3.4978 4.2192 3.4488 1.1999 3.3903 3.1566 1.1741 1.2852 6.0198 7.7279 8.7974 8.2860 6.4934 2.3736 1.5294 6.8648 1.2448 3.4889 1.5459 1.3909 5.2185 2.9047 1.0807 2.2068 2.2049 1.6659 2.1108 1.9283 4.7568 1.7254 1.9910 1.8897 1.8886 3.1108 2.4477 2.4576 5.4657 2.9312 5.1341 1.8136 1.6760 2.0894 1.0771 1.0889 1.0913 1.0973 1.0680 1.0451 1.0830 1.0878 1.1053
irintensity: 6.2391 0.0208 2.4586 1.1077 14.3141 17.6279 1.4982 31.9493 4.9835 5.8320 11.4349 3.4256 395.1058 0.6154 35.0567 1.8253 182.6820 0.3206 2.4989 0.1786 8.3457 4.8879 24.4778 42.7812 6.1347 71.4631 26.7079 5.1933 0.0024 22.0624 14.3917 135.5325 1.1044 7.2472 15.8899 22.3786 9.2162 22.8375 8.3801 60.2802 20.4629 17.6914 665.6893 8.5109 3.7477 1087.2312 163.5115 137.0642 471.7790 275.4380 1000.2118 644.4689 27.0730 12.1458 69.1404 212.2512 101.1361 34.5693 70.4755 38.6481
temp: 298.150 k
press: 1.00000 atm
elementType: 7 7 7 7 7 7 7 6 6 6 6 6 6 1 1 1 1 1 1 1 1 1
symmnumber: 1
zpe: 441031.6 jmol-1
zpe.correction: 0.167980 hartree
zpe.thermalcorrener: 0.179613 hartree
zpe.thermalcorrenthalpy: 0.180558 hartree
zpe.thermalcorrgfe: 0.130166 hartree
zpe.sumelectzpe: -616.371964 hartree
zpe.sumelectthermal: -616.360330 hartree
zpe.sumelectthermalent: -616.359386 hartree
zpe.sumelectthermalfe: -616.409777 hartree
dipole: -4.6987 0.1233 0.0035
dipole: 4.7003
quadrupole: -52.8780 -67.9125 -81.1705
quadrupole: 16.3310 0.0033 0.0033
quadrupole: 14.4423 -0.5922 -13.8502 16.3310 0.0033 0.0033
hfenergy: -616.5399437 hartree
pointgroup: C01 [X(C6H9N7)]
dipole: 1.8476481 -0.0696042 -0.0316476 debye
dipolederiv: -2.6024677 0.3028126 0.1363068 0.7666094 -0.6287542 -0.1408865 0.3389337 -0.1401461 -0.3730717 -0.9112967 0.1799772 0.0799611 -0.4097428 -0.2561086 -0.0011319 -0.1800524 -0.0018637 -0.2530357 -2.328918 -0.4849218 -0.2110358 -0.8759222 -0.8429472 -0.210413 -0.3831013 -0.2109061 -0.4551148 0.2249616 0.0818981 0.0352455 0.2681175 -0.1824954 0.0290569 0.1172044 0.0293098 -0.2367285 -0.6722716 -0.3086713 -0.1359596 0.021999 -1.0513209 -0.1906125 0.0096236 -0.1906431 -0.7027461 -1.8352708 -0.0107913 -0.0019248 -0.0639503 -0.3207794 0.1819502 -0.022712 0.1821646 -0.6512 -0.7271992 0.1329087 0.0589348 -0.1801532 -0.9479995 -0.1507951 -0.079616 -0.1518867 -0.6759554 2.2098176 -0.2062439 -0.0932225 -0.1939771 -0.0013572 -0.0943347 -0.0873213 -0.094642 0.1724486 2.6392987 0.395971 0.1715979 -0.8431459 1.2552693 0.4603169 -0.3739576 0.4585768 0.4141523 -0.5334096 -0.0144425 -0.0058285 0.5576897 0.1366876 0.0889558 0.2459021 0.0901661 -0.0285212 2.4486443 0.0792905 0.0295832 1.1076671 1.3292365 0.4641055 0.4821033 0.465025 0.4802963 0.2138744 -0.134802 -0.0596919 0.3660181 0.2549248 0.1205133 0.1609987 0.1214034 0.0330727 -0.0185582 0.1151388 0.050182 -0.4383221 -0.182959 -0.0317252 -0.1929768 -0.0328119 -0.1233105 0.0133072 -0.0905855 -0.0396231 -0.081462 -0.0032711 -0.0563449 -0.0357135 -0.0564483 0.1004239 -0.024139 -0.07206 -0.0314534 -0.1433928 -0.0275086 -0.0704064 -0.0628108 -0.0705357 0.1020464 -0.129911 -0.0248459 -0.0103144 0.0117314 0.1054867 -0.0262096 0.0056516 -0.0261099 0.1535184 0.1475011 0.0368754 0.0165321 0.0406143 0.2620356 -0.0520831 0.0181939 -0.0519401 0.3575237 0.5006861 -0.0952521 -0.042075 -0.1191973 0.2789381 -0.0222082 -0.0526511 -0.0220856 0.3200942 0.2821548 -0.0270179 -0.0116761 -0.0645221 0.2096991 -0.0823564 -0.0286082 -0.0822642 0.3603023 0.2324589 -0.0000848 0.0003234 0.0233274 0.1706873 -0.0984959 0.0093711 -0.0986492 0.3491827 0.0893858 -0.0668631 -0.0289318 -0.0587424 0.1777493 -0.0933517 -0.0248587 -0.0928389 0.3489981 0.7813514 0.2117097 0.0930701 0.3087564 0.2647869 -0.0235435 0.1363972 -0.0228741 0.3076243 unknown
polarizability: 226.4309631|2.4003653|112.4511922|0.784142|28.5745349|60.1707319 unknown
InChI: InChI=1S/C6H9N7/c7-5(8)13-6(9)12-4-3-10-1-2-11-4/h1-3H,7-9H2
charge 0 multiplicity 1
22 atoms
N  0.376727 0.343687 -0.089252
N  -1.745466 -0.755832 -0.570431
N  2.538195 -0.643323 -0.526024
N  -3.052565 1.562455 0.452625
N  0.622607 -1.843318 -1.052039
N  4.584067 0.349832 -0.093135
N  2.605492 1.553803 0.444149
C  -1.003977 0.32115 -0.097655
C  1.157258 -0.689489 -0.544695
C  -1.706298 1.473176 0.410506
C  3.205651 0.430982 -0.053083
C  -3.106945 -0.65658 -0.523928
C  -3.763438 0.482143 -0.02122
H  -1.131414 2.326883 0.78512
H  -3.672789 -1.515538 -0.901061
H  -4.854112 0.552762 0.012206
H  1.262464 -2.567824 -1.371525
H  -0.416131 -1.89656 -1.073674
H  4.982044 -0.505911 -0.471692
H  5.189885 1.095425 0.236176
H  3.12756 2.353955 0.795362
H  1.544887 1.473525 0.409472
