program: Gaussian 09
title: 000276771
version: EM64L-G09RevD.01
frameworkgroup: C1[X(C9H11N5O3)]
method: RPBEPBE
basis: SDD
operation: Freq
keyword: #p
keyword: freq=noraman
keyword: PBEPBE/SDD
title: #p freq=noraman PBEPBE/SDD
converged: YES YES NO NO
title: Mulliken charges:
elementType: O O O N N N N N C C C C C C C C C H H H H H H H H H H H
charge: -0.416202 -0.430258 -0.348683 -0.317205 -0.196591 -0.631272 -0.622652 -0.632565 0.093063 0.354354 0.171049 -0.533312 -0.307038 -0.414000 0.159981 0.190000 0.248378 0.290663 0.264891 0.245145 0.385795 0.332990 0.350110 0.384755 0.342523 0.311472 0.295162 0.429447
chargesum: 0.00000
title: Mulliken charges with hydrogens summed into heavy atoms:
elementType: O O O N N N N N C C C C C C C C C
charge: -0.030407 -0.045504 -0.348683 -0.317205 -0.196591 0.051828 0.031342 0.092043 0.093063 0.354354 0.171049 -0.242649 -0.042146 -0.168855 0.159981 0.190000 0.248378
polarizability: 3.22567219e+02 2.78505212e-01 1.46393510e+02 2.89475897e+00 1.66573212e-01 7.48719291e+01
1716.lowfreq: -5.5772 -2.7747 -0.0009 -0.0007 -0.0006 4.8789 37.1687 40.6652 70.4805
frequency: 37.1673 40.6618 70.4771 101.4889 120.1613 124.2046 177.7906 185.4428 217.0646 240.1126 280.1629 292.8313 312.0705 343.4993 385.7149 415.8953 439.3243 447.3083 469.1827 493.6743 505.6582 517.7532 535.9007 543.4640 563.3883 575.1316 583.5145 630.3615 667.6253 682.3217 688.3028 711.3363 723.6938 751.6161 770.3877 833.5946 852.3314 861.6042 891.7458 947.2307 951.3869 973.8258 999.8551 1017.2410 1034.4504 1084.1450 1117.2783 1169.2934 1175.8870 1199.5032 1232.4817 1296.3541 1308.3914 1365.6003 1400.5871 1416.6173 1450.9561 1453.5865 1486.5703 1518.7336 1534.5712 1543.1354 1580.7339 1597.9091 1606.0825 1632.0547 1664.0734 2908.6160 2999.3229 3152.2499 3161.6002 3174.9539 3533.2635 3541.3053 3559.9203 3603.5865 3697.2317 3715.0042
redmass: 5.8766 5.9758 4.8622 5.5164 8.2397 6.4482 5.7714 5.8917 6.1799 5.6216 1.1905 4.6673 3.8353 4.7606 5.1867 3.1978 8.4813 2.4928 1.2037 1.2574 4.3263 3.4812 1.1524 1.1742 1.2095 5.8542 4.3811 5.4855 5.1633 4.2576 6.6010 8.2083 5.5904 4.3294 4.7080 1.6211 1.1312 4.5439 1.3975 3.7209 1.0941 1.3262 2.4053 3.9468 1.8182 1.7200 1.5470 1.8371 1.6236 2.3603 1.5578 2.6806 2.2222 4.4190 4.5426 2.7412 3.1335 2.7089 2.9592 3.1780 3.1248 4.3451 5.7578 1.2974 1.8729 2.2895 3.2626 1.0757 1.0693 1.0875 1.0913 1.0976 1.0640 1.0442 1.0452 1.0835 1.1054 1.1053
irintensity: 1.2762 1.0456 1.0189 0.1863 0.5625 3.0380 12.3480 9.9306 6.9108 1.6236 40.6294 0.4669 17.0219 15.8552 25.2497 6.3196 8.2323 46.4607 216.7152 393.3457 11.5449 5.1049 9.3991 42.9136 117.4879 22.5071 30.5448 0.7798 30.8017 26.1576 27.0081 40.5848 6.2664 4.6191 12.0336 28.3438 166.0407 34.4133 3.8337 28.2882 145.8930 0.2173 29.3998 298.2694 75.7038 7.2349 249.0481 8.8460 118.6863 119.1120 99.0275 117.6418 132.0405 142.4270 322.2111 104.8962 372.9422 735.5776 121.7756 118.0808 1036.7696 264.2679 47.2805 114.9685 525.2725 1516.9577 53.7040 765.5759 261.2990 1.9415 2.0970 6.6120 82.9756 51.2020 111.9096 36.5881 52.9239 39.1972
temp: 298.150 k
press: 1.00000 atm
elementType: 8 8 8 7 7 7 7 7 6 6 6 6 6 6 6 6 6 1 1 1 1 1 1 1 1 1 1 1
symmnumber: 1
zpe: 549621.6 jmol-1
zpe.correction: 0.209340 hartree
zpe.thermalcorrener: 0.225241 hartree
zpe.thermalcorrenthalpy: 0.226185 hartree
zpe.thermalcorrgfe: 0.165876 hartree
zpe.sumelectzpe: -847.800381 hartree
zpe.sumelectthermal: -847.784479 hartree
zpe.sumelectthermalent: -847.783535 hartree
zpe.sumelectthermalfe: -847.843844 hartree
dipole: -5.8308 -2.6814 0.4593
dipole: 6.4342
quadrupole: -63.1745 -91.4544 -100.8920
quadrupole: -0.7811 8.9274 7.7462
quadrupole: 21.9991 -6.2807 -15.7184 -0.7811 8.9274 7.7462
hfenergy: -848.0097205 hartree
pointgroup: C01 [X(C9H11N5O3)]
dipole: 2.3165826 -0.4726727 0.9044997 debye
polarizability: 322.3631866|7.3808848|82.8812862|-0.7295621|-22.3540804|138.5881853 unknown
InChI: InChI=1S/C9H11N5O3/c10-8(11)14-9(12)13-4-1-2-5(7(16)17)6(15)3-4/h1-3,15-16H,10-12H2
charge 0 multiplicity 1
28 atoms
O  -2.673137 1.396221 -1.808737
O  -4.692979 -0.845092 1.190163
O  -4.839248 0.56701 -0.640929
N  1.612265 -0.09625 0.009692
N  3.791105 0.130457 -0.993855
N  1.98602 -0.250515 -2.371926
N  5.777305 0.483036 0.14482
N  3.773711 0.261942 1.40385
C  -2.649863 -0.115052 0.139392
C  0.212532 -0.099045 -0.022844
C  -1.974494 0.64626 -0.88207
C  -0.566488 0.647252 -0.954675
C  -1.860502 -0.846228 1.076979
C  -0.468069 -0.839069 1.006466
C  -4.100377 -0.090418 0.178056
C  2.4199 -0.053323 -1.07302
C  4.410354 0.289654 0.193847
H  -0.096702 1.286607 -1.708073
H  -2.377267 -1.418491 1.853218
H  0.138123 -1.402617 1.721806
H  -3.670989 1.288108 -1.61504
H  2.692942 -0.272938 -3.102724
H  1.011539 -0.451602 -2.582927
H  -5.679925 -0.749281 1.114629
H  6.207318 0.493533 -0.776516
H  6.342438 0.629948 0.975698
H  4.259791 0.36872 2.291657
H  2.731395 0.103372 1.294767
