program: Gaussian 09
title: 000276757
version: EM64L-G09RevD.01
frameworkgroup: C1[X(C4H10N2O2)]
method: RPBEPBE
basis: SDD
operation: Freq
keyword: #p
keyword: freq=noraman
keyword: PBEPBE/SDD
title: #p freq=noraman PBEPBE/SDD
converged: YES YES NO NO
title: Mulliken charges:
elementType: O O N N C C C C H H H H H H H H H H
charge: -0.349781 -0.414302 -0.385854 -0.313999 -0.032479 -0.660484 -0.699004 0.304636 0.246887 0.212333 0.196873 0.255818 0.233582 0.225902 0.200862 0.295076 0.304876 0.379058
chargesum: 0.00000
title: Mulliken charges with hydrogens summed into heavy atoms:
elementType: O O N N C C C C
charge: -0.349781 -0.035244 -0.090777 -0.009123 0.214408 0.004539 -0.038658 0.304636
polarizability: 8.97908544e+01 9.54640876e-01 6.20818152e+01 7.65248131e-01 -6.67792886e+00 5.02951375e+01
1716.lowfreq: -0.0007 -0.0007 -0.0002 5.8256 9.7751 17.6859 50.1676 80.9395 143.8228
frequency: 49.2652 80.9151 143.8177 159.1324 215.3965 251.5377 283.9253 315.1586 354.7353 413.9824 441.5568 466.0686 477.3955 488.5024 685.2320 746.6677 836.5217 919.6093 930.8230 948.7959 956.6814 1054.2346 1144.3316 1150.9377 1179.6316 1235.3148 1299.4087 1324.0622 1359.4243 1377.0177 1395.1385 1453.8034 1464.2032 1468.5021 1476.3248 1486.9836 1499.3765 1613.9653 2975.7531 2980.5048 3032.4916 3069.4381 3081.2814 3094.6854 3098.1814 3227.8163 3514.6729 3534.9725
redmass: 3.3802 4.6208 4.1023 3.7323 1.0303 1.1248 3.4836 2.8892 1.9444 2.3705 1.9042 1.1816 2.0076 2.2066 5.5266 4.0767 2.5383 1.3436 1.7496 1.6341 4.3984 3.5196 2.1469 2.0206 2.1750 1.4792 1.3195 1.5770 1.3649 1.2124 1.2293 1.3563 1.0826 1.0460 1.1500 1.0495 1.8235 4.2601 1.0380 1.0365 1.0855 1.0980 1.0982 1.1000 1.1000 1.0640 1.0792 1.0769
irintensity: 6.3054 3.1554 3.3403 5.1631 0.0594 0.7011 25.0957 41.5957 63.2405 41.8789 114.1137 165.1129 79.2776 35.2388 30.7239 30.9858 2.4757 3.2280 3.1560 0.5191 48.5922 1.7957 23.3086 3.5931 72.0865 24.2980 70.8846 77.6059 54.2162 26.2814 28.0274 237.4507 11.3615 3.0027 33.3418 17.8631 197.9527 122.2517 22.9295 26.5191 0.5536 8.7883 67.9470 23.3279 30.9086 42.0695 22.5106 18.6666
temp: 298.150 k
press: 1.00000 atm
elementType: 8 8 7 7 6 6 6 6 1 1 1 1 1 1 1 1 1 1
symmnumber: 1
zpe: 387339.9 jmol-1
zpe.correction: 0.147530 hartree
zpe.thermalcorrener: 0.157418 hartree
zpe.thermalcorrenthalpy: 0.158363 hartree
zpe.thermalcorrgfe: 0.112627 hartree
zpe.sumelectzpe: -417.678209 hartree
zpe.sumelectthermal: -417.668321 hartree
zpe.sumelectthermalent: -417.667377 hartree
zpe.sumelectthermalfe: -417.713112 hartree
dipole: -3.5655 -2.9230 0.7891
dipole: 4.6775
quadrupole: -53.7657 -46.1309 -50.1968
quadrupole: -1.5732 -1.4165 -0.9842
quadrupole: -3.7346 3.9002 -0.1656 -1.5732 -1.4165 -0.9842
hfenergy: -417.8257391 hartree
pointgroup: C01 [X(C4H10N2O2)]
dipole: 1.4139961 1.1683632 0.148964 debye
dipolederiv: -0.753744 -0.0813493 -0.0407845 -0.0966166 -0.8430496 -0.2888792 -0.0986909 -0.2568396 -0.512194 -0.5088119 0.0109789 0.054557 -0.0462134 -0.2661522 0.1184317 -0.1642164 0.086546 -0.3115981 -1.4840715 -0.0666307 0.0279993 -0.3497147 -0.5586011 0.1942959 0.0332059 0.1714566 -0.3273665 -0.4722501 0.1962493 0.1388625 0.4914777 -0.1994162 -0.2219316 0.7117976 -0.2767508 -0.5844012 0.7405112 -0.134772 -0.0591636 -0.2717175 0.3272618 -0.0839404 -0.2380311 -0.1129114 0.2840957 -0.0895315 -0.0008924 0.0063989 0.0726596 -0.0808099 0.1011377 0.0217456 0.1472205 0.0044367 -0.0892171 -0.0213323 0.0399383 -0.0249527 -0.0229212 0.0598302 0.0560738 0.0635449 0.0865868 1.9166358 0.0288826 -0.1834252 0.1285765 0.9902053 0.4737338 -0.1036056 0.4493872 0.5334131 0.0251201 -0.0214939 -0.0644827 0.0287679 0.0251495 -0.0520662 -0.0162169 -0.0249306 -0.0628073 -0.1100157 0.1155977 0.0657651 0.1344984 0.0477724 -0.0257643 0.0736619 -0.0491466 0.0396979 0.0779126 0.0002257 -0.061289 -0.0428105 0.0145103 -0.1204884 -0.0737686 -0.0539779 -0.1062217 0.0173043 -0.1256865 0.0355095 -0.1024835 -0.0066766 0.0489076 0.0291824 0.0304623 0.0734667 0.0806231 0.0577872 -0.0673072 0.0230374 -0.0553142 0.1230489 -0.048228 0.1204458 -0.0103446 -0.1087313 0.0521126 0.0749788 0.0933547 0.045168 -0.0549074 0.0743702 -0.0351383 0.0748121 0.0731642 -0.0287904 -0.0119739 -0.0542969 0.0250862 -0.0663919 -0.0667356 -0.1270208 -0.1188074 0.1169505 -0.0133153 0.0070766 0.0597147 0.2195532 -0.1139941 0.0069269 -0.1525133 0.2111717 0.1213048 -0.047764 0.000751 -0.0425103 0.1043825 -0.0078172 -0.1505203 0.100499 0.3964885 0.4468464 0.0801928 0.0365891 -0.0007709 0.2338519 -0.0832052 -0.0469508 -0.0803331 0.3295715 unknown
polarizability: 89.4503389|1.4326046|62.732901|-3.7443029|5.9561837|49.9845672 unknown
InChI: InChI=1S/C4H10N2O2/c1-3(2)5-4(7)6-8/h3,5-6,8H,1-2H3
charge 0 multiplicity 1
18 atoms
O  -1.062008 -1.087516 -0.434586
O  -3.22761 0.116522 0.433778
N  0.393877 0.614293 0.309184
N  -1.929024 0.698609 0.765727
C  1.624079 -0.041349 -0.20279
C  2.127348 -1.133702 0.770169
C  2.690897 1.036683 -0.477157
C  -0.845314 0.023502 0.162747
H  1.335813 -0.528621 -1.151699
H  3.00614 -1.652321 0.344998
H  2.423195 -0.694367 1.741552
H  1.335089 -1.881282 0.944827
H  2.322584 1.789391 -1.196331
H  3.60057 0.572063 -0.89556
H  2.983672 1.555441 0.457003
H  0.50619 1.382733 0.974201
H  -2.00982 1.719448 0.724033
H  -2.942277 -0.717324 -0.068394
