program: Gaussian 09
title: 000276777
version: EM64L-G09RevD.01
frameworkgroup: C1[X(C10H10N4O2S)]
method: RPBEPBE
basis: SDD
operation: Freq
keyword: #p
keyword: freq=noraman
keyword: PBEPBE/SDD
title: #p freq=noraman PBEPBE/SDD
converged: YES YES NO NO
title: Mulliken charges:
elementType: S O O N N N N C C C C C C C C C C H H H H H H H H H H
charge: 0.942783 -0.541168 -0.543305 -0.416188 -0.709048 0.023235 0.024100 0.516945 -0.075829 -0.464853 -0.314830 -0.402379 -0.245976 -0.202296 -0.110465 -0.145350 -0.153606 0.265787 0.253996 0.317473 0.233102 0.232686 0.286046 0.278077 0.289722 0.323251 0.338089
chargesum: 0.00000
title: Mulliken charges with hydrogens summed into heavy atoms:
elementType: S O O N N N N C C C C C C C C C C
charge: 0.942783 -0.541168 -0.543305 -0.098714 -0.047709 0.023235 0.024100 0.516945 -0.075829 0.054930 -0.081727 -0.169693 0.040069 0.075781 0.179257 -0.145350 -0.153606
polarizability: 2.29211675e+02 -1.47600818e+01 1.49527371e+02 -1.11779482e+01 -1.16856497e+01 1.14481321e+02
1716.lowfreq: -8.0980 -0.0025 -0.0021 -0.0019 3.9196 8.9437 18.9916 25.2291 37.5562
frequency: 18.8390 25.0715 37.4467 52.6314 77.3174 106.1015 118.2883 130.8364 150.3459 156.0764 200.5279 227.1398 251.1884 278.3487 291.6213 321.9310 361.4476 366.0396 369.4345 410.8110 413.1261 466.9614 474.2723 480.8920 505.3247 530.3926 565.2761 599.7767 622.7729 677.4925 724.1184 751.6067 798.3560 802.0826 811.9669 816.2734 831.0001 903.2710 911.7525 953.9578 960.1852 967.0161 983.4691 1057.2671 1065.9941 1068.2432 1096.8132 1137.0244 1191.4931 1204.3662 1242.3626 1289.1807 1303.3979 1311.1728 1357.3309 1385.4420 1423.4499 1468.2078 1481.2678 1519.8704 1533.7615 1597.7456 1610.2482 2205.7550 2206.8340 2983.7616 3013.0556 3088.5454 3130.6117 3152.2478 3167.0041 3171.0153 3360.7193 3528.8408 3558.4351
redmass: 9.0085 8.1286 7.6152 4.4480 6.7373 6.3059 4.1494 2.8417 4.8589 7.1579 3.4829 8.0286 3.4675 3.2053 4.7835 7.2195 6.0762 5.9088 6.5508 4.6263 4.0602 3.9288 4.7814 1.9888 1.7785 2.7039 12.3501 4.6594 6.7890 6.1021 3.0354 4.0188 2.8090 3.1354 1.3222 3.6382 1.8245 2.5227 4.2816 1.3935 4.1044 1.3940 4.5810 2.8331 2.0957 1.4988 2.6905 1.3655 1.1242 1.3759 1.1178 1.5047 1.6651 1.6111 1.2587 3.2311 4.2871 1.1048 2.0922 2.0054 1.0868 5.0353 6.1727 12.5553 12.5674 1.0804 1.0638 1.1020 1.0898 1.0879 1.0954 1.0966 1.0414 1.0998 1.0767
irintensity: 4.0422 2.7953 0.5458 5.2623 0.7709 1.0372 20.7131 12.7344 4.8408 4.2089 14.2208 6.2392 4.5694 1.1348 15.7742 3.8164 1.5330 4.4261 1.1752 35.2074 27.4363 16.4259 71.9929 88.8548 121.2924 62.3306 1.4327 6.7408 1.8354 37.2763 0.3908 2.1123 29.1092 157.9353 18.3271 61.2198 73.4322 4.9894 71.0271 0.3521 22.1017 0.9243 4.4792 48.1427 22.4110 23.3327 72.9514 17.0689 37.7069 9.3985 31.3879 48.8365 60.1781 49.4275 39.2695 31.5742 1.0904 15.5261 34.6517 185.4015 18.5792 12.6933 267.5425 3.2192 4.8698 0.2623 40.7270 5.9417 11.2096 4.8794 0.7960 20.8769 23.7834 21.3626 35.6961
temp: 298.150 k
press: 1.00000 atm
elementType: 16 8 8 7 7 7 7 6 6 6 6 6 6 6 6 6 6 1 1 1 1 1 1 1 1 1 1
symmnumber: 1
zpe: 498928.0 jmol-1
zpe.correction: 0.190032 hartree
zpe.thermalcorrener: 0.207840 hartree
zpe.thermalcorrenthalpy: 0.208784 hartree
zpe.thermalcorrgfe: 0.141790 hartree
zpe.sumelectzpe: -1153.120720 hartree
zpe.sumelectthermal: -1153.102911 hartree
zpe.sumelectthermalent: -1153.101967 hartree
zpe.sumelectthermalfe: -1153.168962 hartree
dipole: 5.4732 -0.8153 -1.8517
dipole: 5.8352
quadrupole: -119.8392 -110.1413 -109.0368
quadrupole: -4.2184 -35.2636 -0.2761
quadrupole: -6.8334 2.8644 3.9690 -4.2184 -35.2636 -0.2761
hfenergy: -1153.3107512 hartree
pointgroup: C01 [X(C10H10N4O2S1)]
dipole: -2.1204078 0.8480679 -0.2348006 debye
polarizability: 227.71254|-22.4014309|118.8064307|-2.9989151|15.0036267|146.7013962 unknown
InChI: InChI=1S/C10H10N4O2S/c11-5-8(6-12)7-14-9-1-3-10(4-2-9)17(13,15)16/h1-4,8,14H,7,13H2
charge 0 multiplicity 1
27 atoms
S  4.215734 -0.482642 -0.216483
O  4.550329 -0.59334 -1.80936
O  5.065566 0.464603 0.800226
N  -1.65025 0.986099 0.304041
N  4.331095 -2.15912 0.547276
N  -2.443684 -2.403646 -1.633996
N  -4.878017 -0.419593 1.539476
C  -0.306129 0.612477 0.147413
C  2.405109 -0.064292 -0.060216
C  -2.647885 1.070986 -0.739158
C  0.220587 0.122459 -1.08255
C  0.566478 0.751559 1.27033
C  1.583511 -0.212757 -1.188268
C  1.924507 0.411159 1.172998
C  -3.64794 -0.165191 -0.817006
C  -2.981477 -1.412661 -1.247798
C  -4.336219 -0.338163 0.480913
H  -3.282431 1.962019 -0.57839
H  -2.16992 1.179935 -1.72663
H  -1.9359 1.279436 1.23883
H  -0.421855 -0.026888 -1.95456
H  0.172562 1.133935 2.219491
H  2.005554 -0.57328 -2.131864
H  2.601149 0.532011 2.024407
H  -4.414445 0.086794 -1.579966
H  4.318082 -2.872941 -0.200486
H  5.200688 -2.176159 1.107029
