program: Gaussian 09
title: 000276789
version: EM64L-G09RevD.01
frameworkgroup: C1[X(C11H13N7O2S2)]
method: RPBEPBE
basis: SDD
operation: Freq
keyword: #p
keyword: freq=noraman
keyword: PBEPBE/SDD
title: #p freq=noraman PBEPBE/SDD
converged: NO YES NO NO
title: Mulliken charges:
elementType: S S O O N N N N N N N C C C C C C C C C C C H H H H H H H H H H H H H
charge: 1.033745 0.217482 -0.487166 -0.487316 -0.619962 -0.311359 -0.024274 -0.194796 -0.631278 -0.620788 -0.630332 -0.180060 -0.216044 -0.230517 0.303556 -0.373272 -0.375712 -0.017384 -0.488595 -0.154732 0.187262 0.250860 0.285401 0.286073 0.355261 0.256934 0.279807 0.265765 0.258091 0.336565 0.339528 0.344858 0.314777 0.427478 0.300146
chargesum: 0.00000
title: Mulliken charges with hydrogens summed into heavy atoms:
elementType: S S O O N N N N N N N C C C C C C C C C C C
charge: 1.033745 0.217482 -0.487166 -0.487316 -0.264701 -0.311359 -0.024274 -0.194796 0.044814 0.038847 0.097292 -0.180060 0.069357 0.055557 0.303556 -0.116338 -0.095906 -0.017384 -0.222831 0.103359 0.187262 0.250860
polarizability: 4.38597505e+02 5.30537264e+00 1.88732120e+02 -5.86589627e+00 1.17822388e+01 1.51696439e+02
1716.lowfreq: -49.7720 -9.5210 -2.0861 0.0010 0.0018 0.0018 3.4021 12.2741 19.8497
frequency: -49.7532 11.0263 19.8180 35.3970 45.9359 53.2179 69.8114 97.2546 106.0792 116.9105 150.6422 154.2767 164.3950 199.4354 205.1878 208.6538 262.7940 274.7427 298.2311 309.9117 333.7705 343.1586 381.1345 402.2445 412.6318 428.8536 438.4769 464.8409 484.7379 502.2072 508.3511 520.7833 531.6782 541.3564 547.5475 584.9741 593.3030 599.5108 617.1282 659.8481 684.7379 690.1743 701.6614 711.4982 716.5530 746.0908 792.8726 822.9219 833.7327 838.8121 856.0753 859.8318 877.1503 931.4222 964.4238 965.3310 978.7100 982.5213 997.7942 1009.4847 1031.6623 1050.7226 1074.4173 1082.9729 1111.5492 1168.6768 1178.0062 1226.3124 1270.6995 1278.8086 1287.3013 1307.9868 1350.7675 1408.0912 1421.9586 1455.5578 1474.1255 1478.6282 1522.3802 1535.5940 1561.4704 1570.9841 1582.5598 1599.5500 1609.6351 1648.0908 2970.8869 3140.6744 3147.5552 3159.3448 3167.9678 3201.2648 3250.7175 3544.3306 3557.9224 3565.2026 3604.2850 3699.2160 3712.1077
redmass: 7.0735 5.1811 7.4266 5.7912 4.9557 5.7637 4.8831 6.6710 5.9611 1.9080 5.7091 5.7645 7.8792 6.4601 9.9954 9.0419 5.0096 3.5095 1.1308 5.0979 5.4067 6.3444 4.9918 6.2117 2.7860 3.4171 8.3780 1.2113 1.2184 3.3888 3.6094 4.0097 3.3636 1.2316 1.2078 4.7876 7.4927 5.7996 6.8273 7.0623 7.8191 1.2959 5.9131 7.8303 3.7800 8.8809 4.3017 9.7422 7.3295 1.2390 1.7976 1.3306 4.2462 1.0968 2.6645 2.2503 1.4867 3.5898 2.6445 2.5196 1.8154 2.4085 1.3012 1.7290 1.3233 1.8991 1.1562 1.7054 2.1315 3.4605 1.3104 1.7322 4.5514 3.6313 3.3361 2.5391 2.1934 5.3596 3.0976 3.3647 7.3239 9.3315 5.1923 1.3123 1.7493 2.1140 1.0740 1.0877 1.0882 1.0967 1.0973 1.0915 1.1015 1.0441 1.0453 1.0795 1.0841 1.1054 1.1053
irintensity: 15.6477 0.1628 0.4034 0.3037 3.0139 0.5640 2.8432 2.4297 0.3066 48.5882 38.6255 10.1286 8.2188 8.5947 2.8232 3.6845 12.5503 5.9823 28.9078 35.6199 40.7839 8.4870 11.6136 29.5596 7.3836 40.6330 189.9414 66.0882 473.1756 35.4254 12.2790 44.0335 13.8911 63.2508 58.1299 19.5256 87.1817 133.2676 3.2750 1.0469 16.0355 65.3615 0.1937 41.7545 7.6880 48.4525 21.2739 74.0357 64.0788 3.9886 56.7285 3.5276 12.8183 139.0840 47.4101 41.7109 0.6942 5.4568 5.1528 114.6663 10.9879 99.5059 43.6721 8.1701 9.2798 5.0958 80.7708 19.6029 30.3885 256.7236 5.5980 209.1015 20.8475 76.6559 81.3892 292.5039 389.5124 18.9162 386.5500 1561.7896 53.6929 509.4144 166.2991 275.0059 301.2381 905.5715 762.8465 2.1879 1.6702 3.8555 8.0103 10.1490 1.2449 52.3128 127.0188 55.9501 45.3534 50.8146 41.2594
temp: 298.150 k
press: 1.00000 atm
elementType: 16 16 8 8 7 7 7 7 7 7 7 6 6 6 6 6 6 6 6 6 6 6 1 1 1 1 1 1 1 1 1 1 1 1 1
symmnumber: 1
zpe: 649883.5 jmol-1
zpe.correction: 0.247528 hartree
zpe.thermalcorrener: 0.269447 hartree
zpe.thermalcorrenthalpy: 0.270392 hartree
zpe.thermalcorrgfe: 0.193557 hartree
zpe.sumelectzpe: -1755.027288 hartree
zpe.sumelectthermal: -1755.005368 hartree
zpe.sumelectthermalent: -1755.004424 hartree
zpe.sumelectthermalfe: -1755.081259 hartree
dipole: 11.2103 4.7793 -1.8024
dipole: 12.3192
quadrupole: -85.2635 -147.3500 -145.1010
quadrupole: -20.4888 -3.4821 8.8717
quadrupole: 40.6413 -21.4452 -19.1961 -20.4888 -3.4821 8.8717
hfenergy: -1755.274816 hartree
pointgroup: C01 [X(C11H13N7O2S2)]
dipole: 4.4191736 -0.9277699 1.7609486 debye
polarizability: 438.4895401|-9.0658696|181.0776298|1.1228334|-19.3122052|159.4588932 unknown
InChI: InChI=1S/C11H13N7O2S2/c12-9(13)17-10(14)16-7-1-3-8(4-2-7)22(19,20)18-11-15-5-6-21-11/h1-6,18H,12-14H2
charge 0 multiplicity 1
35 atoms
S  -2.492589 0.638536 -1.290333
S  -5.194011 -1.036676 2.054071
O  -2.803745 2.226217 -1.254212
O  -2.866131 -0.261615 -2.581924
N  -3.210695 -0.166234 0.247075
N  3.391967 -0.140048 0.037162
N  -5.515536 0.184656 -0.327889
N  5.428882 -1.37438 0.402055
N  3.423338 -2.469571 0.675628
N  7.579646 -0.535582 0.221437
N  5.756276 0.936874 -0.16337
C  -0.697681 0.34987 -0.839242
C  -0.02067 1.3451 -0.107304
C  -0.069601 -0.817472 -1.310609
C  2.021151 -0.047644 -0.231667
C  1.336904 1.137232 0.191105
C  1.289391 -1.014814 -1.001438
C  -4.565737 -0.247892 0.477294
C  -6.854435 -0.68059 1.427691
C  -6.792604 -0.054591 0.198313
C  4.050296 -1.28057 0.338251
C  6.220162 -0.311939 0.144663
H  -0.540427 2.259707 0.196959
H  -0.624291 -1.531756 -1.928611
H  -2.51368 -0.498039 0.916824
H  1.901677 1.885439 0.755836
H  1.80767 -1.893416 -1.400051
H  -7.72583 -0.96062 2.014904
H  -7.66098 0.260807 -0.381053
H  4.01807 -3.244904 0.958828
H  2.412671 -2.533646 0.765288
H  7.877683 -1.47813 0.460487
H  8.268909 0.187082 0.035401
H  4.7019 0.97591 -0.186117
H  6.367845 1.731598 -0.338251
