program: Gaussian 09
title: 000276741
version: EM64L-G09RevD.01
frameworkgroup: C1[X(C5H12N2O2S)]
method: RPBEPBE
basis: SDD
operation: Freq
keyword: #p
keyword: freq=noraman
keyword: PBEPBE/SDD
title: #p freq=noraman PBEPBE/SDD
converged: NO NO NO NO
title: Mulliken charges:
elementType: S O O N N C C C C C H H H H H H H H H H H H
charge: 1.102415 -0.542763 -0.542743 -0.306329 -0.724904 -0.377492 -0.377490 -0.404977 -0.369061 -0.368895 0.264447 0.217151 0.217029 0.264461 0.222282 0.208764 0.208754 0.222298 0.197898 0.223529 0.332853 0.332774
chargesum: 0.00000
title: Mulliken charges with hydrogens summed into heavy atoms:
elementType: S O O N N C C C C C
charge: 1.102415 -0.542763 -0.542743 -0.306329 -0.059277 0.053553 0.053562 0.016450 0.112537 0.112595
polarizability: 1.21919760e+02 1.03136442e-02 9.79939218e+01 3.17295331e+00 1.12530004e-03 8.35900367e+01
1716.lowfreq: -0.0020 0.0000 0.0015 6.0309 11.7537 21.8431 55.2649 77.4605 150.0807
frequency: 55.0360 77.3436 150.0768 182.4011 187.2752 214.9532 235.9133 280.9608 281.2127 339.7627 354.7110 379.2735 422.2347 435.8904 461.6419 490.9248 598.4643 790.1504 802.2287 804.4703 820.6934 849.3227 863.6687 894.8941 916.4781 961.8336 1004.6137 1036.1169 1052.4132 1068.2947 1104.0758 1145.4514 1150.8451 1213.9052 1256.5793 1261.4848 1276.7572 1323.3830 1337.0133 1344.7630 1345.3222 1353.4756 1449.9537 1460.3244 1468.1192 1471.2873 1484.1502 1525.6809 2930.0505 2932.2405 2975.7074 2998.3515 2998.6179 3043.2345 3059.8140 3067.0586 3075.9629 3078.9136 3357.0341 3521.2300
redmass: 3.9621 4.0413 5.5521 3.5412 1.8931 4.9760 1.9177 4.2362 1.7478 3.3656 5.3281 2.5212 3.9494 3.1511 5.3560 2.7237 2.2315 1.6604 3.7633 1.4248 5.2400 2.5144 1.6608 2.7737 2.2785 1.2862 2.1894 2.0445 1.7842 1.8015 2.5720 2.1956 1.1845 1.9207 1.2682 1.2031 1.2703 1.2359 1.3542 1.3763 1.4540 1.3197 1.0882 1.0859 1.0879 1.0771 1.0888 1.0867 1.0683 1.0668 1.0632 1.0624 1.0597 1.0972 1.1021 1.1014 1.0941 1.0970 1.0414 1.0996
irintensity: 0.2832 1.8766 0.2567 3.0870 36.2374 6.5716 0.5186 2.8859 11.8645 1.6927 0.0954 19.9594 24.5261 0.0008 166.1545 26.2231 4.0959 65.8320 8.4181 0.0092 161.0421 18.0455 25.0432 45.3717 9.7154 2.9262 11.8262 1.1919 15.5483 26.9729 0.2924 12.2046 1.1456 19.1099 3.8528 13.2543 9.2130 0.2005 2.0967 2.2684 1.3790 0.4089 6.9489 15.8347 16.6895 1.9605 16.7907 24.6948 17.8538 58.4809 35.3236 16.8140 46.3418 43.3695 18.9165 47.1074 4.7902 23.6349 24.5468 23.4697
temp: 298.150 k
press: 1.00000 atm
elementType: 16 8 8 7 7 6 6 6 6 6 1 1 1 1 1 1 1 1 1 1 1 1
symmnumber: 1
zpe: 466687.4 jmol-1
zpe.correction: 0.177752 hartree
zpe.thermalcorrener: 0.189114 hartree
zpe.thermalcorrenthalpy: 0.190058 hartree
zpe.thermalcorrgfe: 0.140920 hartree
zpe.sumelectzpe: -854.731249 hartree
zpe.sumelectthermal: -854.719887 hartree
zpe.sumelectthermalent: -854.718942 hartree
zpe.sumelectthermalfe: -854.768081 hartree
dipole: -3.2043 -0.0032 3.7933
dipole: 4.9656
quadrupole: -66.0278 -70.3432 -70.4732
quadrupole: -0.0130 10.3518 -0.0147
quadrupole: 2.9202 -1.3951 -1.5251 -0.0130 10.3518 -0.0147
hfenergy: -854.9090007 hartree
pointgroup: C01 [X(C5H12N2O2S1)]
dipole: -1.3308702 -0.0520019 -1.4292239 debye
dipolederiv: 1.8832061 0.007436 -0.1914046 0.0087666 1.2001813 0.0057502 -0.1341878 0.0068252 1.6233109 -0.712173 0.0628854 -0.0078935 0.1375796 -0.619867 0.1523852 -0.0399773 0.0047545 -0.5342971 -0.7053277 -0.0656054 -0.0000181 -0.1418368 -0.633265 -0.1485274 -0.0339992 -0.0020249 -0.5279094 -0.2976053 0.0008989 -0.0836422 -0.0018331 -0.4689748 -0.001387 -0.2295195 -0.0037735 -0.4669113 -0.7354321 -0.0042949 0.0946548 -0.0007874 -0.3698071 -0.0106058 0.2577932 -0.0078697 -0.9346331 0.1613703 0.0244276 -0.0039276 -0.1453911 0.0447497 0.0270603 -0.1134659 -0.0474795 0.1448077 0.157143 -0.0209171 -0.0020967 0.1435875 0.0498649 -0.0228914 -0.1212102 0.0477053 0.1437497 0.0458391 0.0004451 -0.0077636 0.0016667 0.0124874 0.0026111 0.0468684 0.0035028 0.1390553 -0.1033584 0.0697725 0.0438337 0.3301839 0.2479212 0.0618839 0.1860848 0.1088891 0.2822758 -0.0896797 -0.0788551 0.0492009 -0.3327394 0.2269943 -0.0582626 0.2043518 -0.1001024 0.2894297 0.054797 0.1058863 -0.030337 0.031558 -0.0062619 0.013567 -0.039358 0.0290345 0.0686768 0.0299844 -0.0383232 0.007448 -0.0711959 0.0223124 0.0340407 -0.0524761 -0.0818823 -0.165632 0.0263151 0.0388734 0.0067309 0.0688653 0.0275816 -0.042372 -0.0583039 0.0714141 -0.1674087 0.0593285 -0.1050976 -0.0251823 -0.0311235 -0.0122678 -0.0108065 -0.0369752 -0.0266766 0.0705507 0.057221 0.0293036 -0.0160629 0.0405941 0.0757881 -0.0167487 0.0242591 0.0452755 -0.1450357 -0.0599158 -0.0983186 -0.0131842 -0.079912 -0.1297969 -0.0482075 -0.0287153 -0.0738478 0.0674842 -0.0657017 0.0995694 -0.0192009 0.0805436 -0.1183194 0.0559215 -0.0347472 0.0810895 0.0617798 0.0595427 -0.0304649 -0.0151646 -0.0399239 0.0718385 0.0066578 0.0275514 -0.0539657 -0.1433262 0.0870563 0.0013218 0.008838 -0.0004326 0.0177939 -0.0041917 -0.073159 -0.005559 -0.1835833 -0.1968979 -0.0026494 0.0723408 -0.0021667 0.0602968 0.0011691 0.0949964 0.001538 0.0590601 0.169965 0.0848409 0.0631879 0.0342123 0.1553955 0.08394 0.0755974 0.0477791 0.1565508 0.1743233 -0.0811347 0.0696429 -0.0302151 0.1453541 -0.0809864 0.0785923 -0.0446261 0.1620054 unknown
polarizability: 121.5199643|0.2676093|97.9896996|-5.0069085|-0.3877146|83.9940546 unknown
InChI: InChI=1S/C5H12N2O2S/c6-10(8,9)7-4-2-1-3-5-7/h1-6H2
charge 0 multiplicity 1
22 atoms
S  1.771323 0.049536 0.073253
O  2.330927 -1.359695 0.648391
O  2.282346 1.50001 0.588306
N  -0.06377 0.023885 0.302019
N  2.060556 0.015375 -1.768704
C  -2.12799 -1.28109 0.312983
C  -2.169473 1.260759 0.257609
C  -2.908826 -0.032175 -0.15798
C  -0.667012 -1.245938 -0.193981
C  -0.707898 1.250312 -0.249143
H  -0.087637 -2.089162 0.216988
H  -0.645461 -1.290617 -1.30639
H  -0.688225 1.245872 -1.362548
H  -0.155676 2.129156 0.122736
H  -2.117807 -1.324653 1.417988
H  -2.604123 -2.20866 -0.057577
H  -2.675162 2.155373 -0.152712
H  -2.161158 1.352952 1.359657
H  -3.015129 -0.057857 -1.262114
H  -3.930665 -0.039709 0.264488
H  2.598154 -0.840883 -1.988029
H  2.566505 0.880614 -2.024941
