program: Gaussian 09
title: 000276765
version: EM64L-G09RevD.01
frameworkgroup: C1[X(C8H11N5O3S)]
method: RPBEPBE
basis: SDD
operation: Freq
keyword: #p
keyword: freq=noraman
keyword: PBEPBE/SDD
title: #p freq=noraman PBEPBE/SDD
converged: YES YES NO NO
title: Mulliken charges:
elementType: S O O O N N N N N C C C C C C C C H H H H H H H H H H H
charge: 0.989250 -0.557543 -0.510662 -0.551863 -0.246642 -0.186131 -0.630957 -0.627269 -0.627360 -0.265725 0.360256 -0.240795 -0.362472 -0.253806 -0.204750 0.158312 0.244920 0.292565 0.273554 0.241435 0.229478 0.373735 0.333413 0.340370 0.342376 0.312964 0.302313 0.471034
chargesum: 0.00000
title: Mulliken charges with hydrogens summed into heavy atoms:
elementType: S O O O N N N N N C C C C C C C C
charge: 0.989250 -0.183808 -0.510662 -0.551863 -0.246642 -0.186131 0.042826 0.028070 0.145988 -0.265725 0.360256 0.051770 -0.088918 -0.012371 0.024728 0.158312 0.244920
polarizability: 2.52823163e+02 -1.79389097e+01 1.79437070e+02 6.26005606e+00 8.18350619e+00 9.64348574e+01
1716.lowfreq: -6.2443 -5.8196 -3.3215 -0.0024 -0.0014 0.0010 38.3992 46.2432 71.1658
frequency: 38.3913 46.2193 71.1382 87.2219 90.8164 113.4963 120.2088 158.7818 173.1362 190.2439 211.4846 227.3120 251.1386 278.3506 297.1315 305.5855 325.4503 343.1587 380.3775 419.0380 440.9362 454.2555 478.9608 486.2502 509.6423 530.8580 543.6856 554.9797 565.9342 572.4609 640.9179 672.8284 697.0050 717.4009 731.1652 761.1973 790.5970 826.7074 872.8609 875.3228 907.0367 942.4932 961.0983 978.6111 987.6155 1004.9036 1026.1977 1035.9084 1047.1472 1061.8108 1126.9519 1156.9872 1168.7114 1244.3238 1295.1243 1355.3112 1412.1636 1431.9513 1460.3626 1492.7089 1529.4911 1539.4940 1545.7217 1588.6778 1601.5901 1612.2813 1630.8877 3130.2093 3150.8498 3155.8154 3174.9421 3227.6141 3482.4090 3539.1230 3559.8300 3609.6567 3693.8377 3714.6346
redmass: 4.2146 4.5573 3.3594 4.9370 5.9370 1.8495 6.8014 6.0410 5.1572 5.7661 4.0986 8.4455 7.2828 6.9409 5.0364 1.1078 5.6465 6.3392 3.0179 5.7858 2.5528 4.4435 1.2887 1.2475 2.9666 2.5554 2.1847 3.9664 1.2306 3.0499 6.5059 6.0849 6.8684 8.5475 4.6468 1.2803 5.2135 11.8103 1.7567 2.2093 1.4364 4.6457 1.3713 6.1355 1.3224 3.0493 1.6092 1.8068 1.7158 1.2439 1.6205 2.2187 1.0686 1.6028 3.3530 3.1050 3.2535 3.1813 2.8057 2.0824 4.8745 2.5077 3.7156 4.0571 1.3663 2.2089 2.0511 1.0865 1.0891 1.0944 1.0997 1.0670 1.0661 1.0441 1.0452 1.0866 1.1052 1.1053
irintensity: 5.3671 11.2586 46.8812 1.3075 2.0053 77.5028 1.1789 2.8083 4.9864 2.7709 9.4349 2.7416 4.1170 21.5440 6.7390 57.7911 8.2792 9.2592 1.6320 48.3642 14.0909 27.5711 15.3521 356.1461 2.0660 9.5259 208.5016 10.3671 24.1472 119.9670 9.3501 7.8541 3.1339 30.5523 1.2379 76.9231 14.1053 61.0344 22.3820 36.8900 149.6122 87.5236 3.7471 27.2077 0.7602 12.3105 3.0778 28.2568 5.7593 38.5813 8.3747 5.9359 5.0461 7.5250 103.4512 11.1079 238.5800 17.8732 6.0511 192.0563 1340.9483 347.4077 218.2235 138.4896 284.9338 413.0658 307.7812 10.4392 7.7185 2.2791 20.2429 455.7653 34.7527 56.1523 103.4031 51.7352 39.6960 39.4786
temp: 298.150 k
press: 1.00000 atm
elementType: 16 8 8 8 7 7 7 7 7 6 6 6 6 6 6 6 6 1 1 1 1 1 1 1 1 1 1 1
symmnumber: 1
zpe: 528971.5 jmol-1
zpe.correction: 0.201475 hartree
zpe.thermalcorrener: 0.219370 hartree
zpe.thermalcorrenthalpy: 0.220314 hartree
zpe.thermalcorrgfe: 0.155835 hartree
zpe.sumelectzpe: -1207.532985 hartree
zpe.sumelectthermal: -1207.515090 hartree
zpe.sumelectthermalent: -1207.514145 hartree
zpe.sumelectthermalfe: -1207.578624 hartree
dipole: 5.4771 3.3759 0.1689
dipole: 6.4362
quadrupole: -82.2239 -99.6886 -108.3454
quadrupole: -19.6051 -0.4143 3.0882
quadrupole: 14.5287 -2.9360 -11.5928 -19.6051 -0.4143 3.0882
hfenergy: -1207.7344594 hartree
pointgroup: C01 [X(C8H11N5O3S1)]
dipole: 2.090647 -0.8602414 -1.1406611 debye
polarizability: 248.4102969|31.2358507|144.3598538|-12.2490493|38.719203|135.9249403 unknown
InChI: InChI=1S/C8H11N5O3S/c9-7(10)13-8(11)12-5-3-1-2-4-6(5)17(14,15)16/h1-4,14H,9-11H2
charge 0 multiplicity 1
28 atoms
S  -1.259672 1.288078 1.191928
O  -0.946789 2.333492 -0.316943
O  -2.618695 1.803957 1.898196
O  0.102087 1.326513 2.080953
N  0.72811 -0.482238 -0.320046
N  2.998954 -0.347378 -1.09447
N  1.378034 -1.037582 -2.575469
N  4.852526 0.336468 0.098707
N  2.740539 0.555186 1.133086
C  -1.613124 -0.334484 0.340403
C  -0.555452 -1.000938 -0.350673
C  -2.933936 -0.800045 0.448417
C  -0.935215 -2.260344 -0.936109
C  -3.260807 -2.032548 -0.152679
C  -2.248174 -2.754235 -0.834378
C  1.6620 -0.628292 -1.279637
C  3.480571 0.170723 0.055387
H  -3.675012 -0.205956 0.993025
H  -0.163401 -2.858385 -1.432115
H  -4.279788 -2.423944 -0.083776
H  -2.487685 -3.72414 -1.285632
H  -0.29164 3.035152 -0.032341
H  2.144515 -1.023162 -3.244706
H  0.418209 -1.136979 -2.897404
H  5.374683 0.055089 -0.726886
H  5.340288 0.678019 0.921714
H  3.148963 1.018457 1.942751
H  1.711214 0.417419 1.082998
