program: Gaussian 09
title: 000276796
version: EM64L-G09RevD.01
frameworkgroup: C1[X(C12H11N7O3S2)]
method: RPBEPBE
basis: SDD
operation: Freq
keyword: #p
keyword: freq=noraman
keyword: PBEPBE/SDD
title: #p freq=noraman PBEPBE/SDD
converged: YES YES NO NO
title: Mulliken charges:
elementType: S S O O O N N N N N N N C C C C C C C C C C C C H H H H H H H H H H H
charge: 0.917277 0.274770 -0.525003 -0.484290 -0.207028 -0.440186 -0.060419 -0.391901 -0.075953 -0.046906 -0.607000 -0.014871 -0.051821 -0.391633 -0.167192 -0.245645 0.164691 0.188330 -0.337029 -0.258949 0.193474 -0.128601 -0.477805 -0.146856 0.292976 0.307134 0.293715 0.268300 0.288685 0.313747 0.348079 0.333989 0.334519 0.275649 0.263751
chargesum: 0.00000
title: Mulliken charges with hydrogens summed into heavy atoms:
elementType: S S O O O N N N N N N N C C C C C C C C C C C C
charge: 0.917277 0.274770 -0.525003 -0.484290 -0.207028 -0.126439 -0.060419 -0.043822 -0.075953 -0.046906 0.061509 -0.014871 -0.051821 -0.098658 0.139942 0.048070 0.164691 0.188330 -0.068729 0.029736 0.193474 -0.128601 -0.202156 0.116895
polarizability: 4.82020152e+02 -4.54147460e+01 2.13567658e+02 -1.31307801e+00 1.99024165e+01 1.79100319e+02
1716.lowfreq: -8.1009 -2.6453 -0.0016 -0.0010 -0.0008 1.1727 9.3057 19.5093 24.0416
frequency: 6.4677 18.6448 23.8059 32.8278 39.9284 51.2125 57.7406 76.2721 85.0982 101.7910 127.3736 137.7319 174.3757 182.3862 189.1940 222.6864 262.3435 281.3020 286.6512 303.6988 316.7862 346.1142 359.3758 373.5570 382.5452 401.8961 413.7536 444.9450 455.1050 492.7615 499.0617 518.2737 535.4155 539.2243 558.7562 571.4606 592.2817 611.4828 624.2167 626.0571 636.4960 708.2449 709.3251 728.9827 732.9693 742.6473 779.6713 803.2203 817.8278 843.1248 843.8321 856.8990 874.7598 877.5643 933.8200 945.5418 971.7106 978.8054 987.5379 999.2534 1006.7946 1033.1586 1043.2781 1075.7138 1107.8546 1121.4259 1149.9832 1171.8722 1192.0497 1209.1997 1217.3528 1263.8704 1266.0879 1290.4916 1299.7649 1338.6362 1376.8055 1391.4351 1406.1472 1421.0948 1429.8015 1456.9530 1483.4530 1575.5942 1590.9113 1592.0645 1634.9188 1686.0948 2985.0079 3153.0043 3155.5856 3173.4891 3175.9062 3201.6181 3247.5315 3415.4448 3551.2348 3614.6130 3699.9390
redmass: 6.8468 4.4557 8.5071 7.1707 9.0011 7.8070 8.5514 8.1191 6.8012 8.5034 9.0019 12.8776 8.9364 9.1720 8.4646 5.9019 9.7920 4.6572 3.5601 6.3617 6.6034 6.2169 7.5858 1.6033 4.6381 3.6289 6.2280 6.7063 2.8697 2.6333 4.5685 1.8597 4.4978 3.6796 2.8232 1.7790 6.3977 6.9421 5.8134 5.3830 7.1882 3.6386 4.0072 3.6241 1.5973 9.3463 2.0515 6.6653 6.9174 1.5837 3.2633 2.1564 1.3455 2.1727 4.1921 13.2605 2.2807 1.4176 4.7183 1.3885 3.1264 5.5694 2.7546 1.2640 1.2996 2.5626 1.7255 1.9735 1.8024 2.4943 1.2718 2.5073 1.4945 1.2843 2.3055 1.5500 5.7725 10.6593 3.6856 5.0174 4.0383 2.1614 5.6664 6.3931 7.1630 2.0361 2.1268 9.2296 1.0816 1.0912 1.0890 1.0961 1.0967 1.0920 1.1005 1.0768 1.0457 1.0812 1.1040
irintensity: 0.6000 1.0621 0.3142 1.0864 1.9866 0.2564 1.9192 0.7539 0.4238 1.3918 1.5795 9.5952 12.9275 4.4080 7.3336 3.7267 9.1760 3.8255 26.4233 49.5204 7.1340 23.0077 11.7135 106.1512 9.5919 10.0213 46.4067 95.7672 78.9228 55.3115 16.4727 88.6373 17.8771 43.7664 93.2997 118.7965 4.9576 2.2158 11.1542 25.6352 24.1227 47.7458 21.4013 2.2831 34.0172 43.4893 139.7829 36.6167 85.6194 21.5579 1.2016 49.2437 1.7075 33.6312 7.4082 41.9311 33.3146 2.6491 9.1954 0.6544 104.6048 84.7083 6.4937 5.5164 6.0907 12.6262 4.7788 110.2850 13.6018 72.2849 23.4114 23.5263 13.7857 0.5889 3.0980 26.0698 11.9349 11.6618 18.0298 58.2603 45.8289 16.7842 18.4198 6.9929 2.1622 57.2958 483.7415 101.5480 19.2910 15.8853 3.7855 3.7771 0.8237 8.8390 1.1290 31.6070 73.5040 90.9359 45.9705
temp: 298.150 k
press: 1.00000 atm
elementType: 16 16 8 8 8 7 7 7 7 7 7 7 6 6 6 6 6 6 6 6 6 6 6 6 1 1 1 1 1 1 1 1 1 1 1
symmnumber: 1
zpe: 611907.9 jmol-1
zpe.correction: 0.233063 hartree
zpe.thermalcorrener: 0.256467 hartree
zpe.thermalcorrenthalpy: 0.257411 hartree
zpe.thermalcorrgfe: 0.174850 hartree
zpe.sumelectzpe: -1866.950821 hartree
zpe.sumelectthermal: -1866.927417 hartree
zpe.sumelectthermalent: -1866.926473 hartree
zpe.sumelectthermalfe: -1867.009034 hartree
dipole: 0.0738 -5.1996 4.6305
dipole: 6.9630
quadrupole: -134.5288 -153.2332 -154.4354
quadrupole: -12.3631 -13.4719 4.0880
quadrupole: 12.8704 -5.8340 -7.0363 -12.3631 -13.4719 4.0880
hfenergy: -1867.1838844 hartree
pointgroup: C01 [X(C12H11N7O3S2)]
dipole: 0.5313317 -2.6773499 -0.2325239 debye
polarizability: 457.7658384|93.1379289|208.6413353|-8.6137826|-22.2787655|208.2809554 unknown
InChI: InChI=1S/C12H11N7O3S2/c13-10-9(11(20)18-17-10)16-15-7-1-3-8(4-2-7)24(21,22)19-12-14-5-6-23-12/h1-6,9,18-19H,13H2
charge 0 multiplicity 1
35 atoms
S  -3.340809 0.714252 -1.127945
S  -6.442504 -2.289819 -0.570914
O  -3.29903 1.288578 -2.653295
O  -4.263174 1.39225 0.025077
O  4.71708 2.725456 1.889088
N  -3.853223 -1.272459 -1.298311
N  3.32717 0.51833 0.158389
N  6.456304 1.834098 0.533072
N  2.350526 0.219388 0.967025
N  6.768196 0.664923 -0.243141
N  5.617189 -1.371882 -0.691059
N  -4.297321 -1.819944 0.993416
C  -1.568856 0.548876 -0.509569
C  4.635702 0.408282 0.828836
C  -1.361795 0.024029 0.776226
C  -0.543942 0.980846 -1.371932
C  1.037737 0.362844 0.387568
C  5.718279 -0.139663 -0.093666
C  -0.027112 -0.061789 1.223738
C  0.781321 0.890501 -0.908755
C  5.230622 1.832343 1.173955
C  -4.660873 -1.737218 -0.290239
C  -6.501678 -2.660966 1.172638
C  -5.308892 -2.31582 1.801445
H  4.558176 -0.15624 1.780935
H  -2.201547 -0.324102 1.386098
H  -0.787568 1.380017 -2.361739
H  0.212284 -0.457274 2.215439
H  1.621992 1.221478 -1.525316
H  -4.244474 -1.323191 -2.255575
H  7.13711 2.590976 0.548624
H  6.359964 -1.691269 -1.310159
H  4.745281 -1.891549 -0.650376
H  -7.381634 -3.127466 1.610392
H  -5.120603 -2.435918 2.86883
