program: Gaussian 09
title: 000276856
version: EM64L-G09RevD.01
frameworkgroup: C1[X(C29H19NO7)]
method: RPBEPBE
basis: SDD
operation: Freq
keyword: #p
keyword: freq=noraman
keyword: PBEPBE/SDD
title: #p freq=noraman PBEPBE/SDD
converged: YES YES NO NO
title: Mulliken charges:
elementType: O O O O O O O N C C C C C C C C C C C C C C C C C C C C C C C C C C C C C H H H H H H H H H H H H H H H H H H H
charge: -0.420969 -0.399743 -0.134217 -0.149313 -0.126088 -0.132178 -0.261976 -0.609248 -0.430668 0.232365 0.209576 0.330505 0.042234 0.015378 -0.157015 -0.177023 0.445999 0.351568 -0.368708 -0.381787 0.247194 0.296788 -0.220963 -0.227799 0.414253 -0.399425 -0.406941 -0.378431 -0.390271 -0.368879 -0.375233 -0.638625 -0.256643 -0.224496 -0.233048 -0.235737 0.204706 0.317865 0.252760 0.262417 0.248067 0.242205 0.195720 0.288865 0.297504 0.293713 0.254920 0.253477 0.366413 0.389819 0.243261 0.239131 0.249606 0.243190 0.344450 0.331473
chargesum: 0.00000
title: Mulliken charges with hydrogens summed into heavy atoms:
elementType: O O O O O O O N C C C C C C C C C C C C C C C C C C C C C C C C C C C C C
charge: -0.054556 -0.009924 -0.134217 -0.149313 -0.126088 -0.132178 -0.261976 0.066675 -0.112802 0.232365 0.209576 0.330505 0.042234 0.015378 -0.157015 -0.177023 0.445999 0.351568 -0.115948 -0.119370 0.247194 0.296788 -0.220963 -0.227799 0.414253 -0.151358 -0.164735 -0.182711 -0.101406 -0.071374 -0.081520 -0.130229 -0.013381 0.014635 0.016558 0.007454 0.204706
polarizability: 4.13742465e+02 -2.35275045e+01 3.65266528e+02 -1.65731617e+01 1.87433833e+01 3.20707771e+02
1716.lowfreq: -6.4745 -3.7639 -0.5608 0.0002 0.0004 0.0006 12.9939 16.8904 20.3056
frequency: 12.7262 16.8575 20.2403 23.3491 26.0531 28.1437 40.7123 49.2680 56.2762 65.8401 78.2563 90.8413 99.8324 113.5126 132.5287 163.8661 169.1043 180.2744 185.0110 188.6081 212.2023 267.1091 275.9487 281.3655 296.0284 319.2643 332.2562 339.5866 353.6836 362.2700 364.3634 366.5839 380.7727 395.1380 404.7617 407.2251 410.1849 421.7500 439.2538 449.5386 458.1984 467.9859 480.0568 494.2640 511.1336 519.5608 529.9432 559.1026 562.0928 566.4510 575.3581 609.8394 615.9723 630.8474 637.5319 653.4140 659.1815 661.9957 675.7284 680.2051 703.1199 713.3933 725.6281 731.4712 742.3425 771.5366 782.3901 791.1940 802.8944 842.8152 846.3721 848.2195 856.9814 860.9592 866.9160 890.6007 896.4865 920.3618 923.6666 931.1382 945.4880 964.3708 972.9057 979.9584 982.6388 990.1504 1006.9165 1010.2297 1010.2862 1014.0234 1040.0890 1042.1178 1057.9617 1080.4618 1086.8766 1117.8973 1124.5303 1152.0990 1174.1323 1177.0453 1178.7607 1190.9214 1197.3333 1207.5680 1213.9461 1216.6232 1217.6383 1223.2485 1250.3443 1261.2160 1275.0827 1280.1967 1282.5022 1296.1279 1301.2880 1321.1619 1337.9779 1357.6867 1382.9118 1391.1996 1394.9599 1398.2139 1411.6185 1437.3814 1438.9958 1451.5660 1482.0927 1483.2782 1502.3737 1525.3323 1543.2845 1569.7425 1572.0440 1572.8309 1579.3599 1580.2061 1585.0803 1602.1079 1615.2216 1616.2589 1618.2168 1633.4778 1645.2952 2965.8881 3009.8006 3069.6004 3099.1620 3120.2238 3127.8771 3138.4811 3142.9261 3146.2886 3152.4787 3154.6553 3157.3053 3167.1129 3174.2763 3182.4801 3379.2122 3510.3544 3576.1941 3664.6173
redmass: 6.0945 7.8571 7.5193 7.8496 6.0357 5.6157 5.2720 5.0319 11.9835 7.0640 6.4218 5.7671 5.2409 4.7256 5.2508 7.9672 7.5824 6.0471 6.0205 5.7242 4.4999 2.2663 5.6164 2.5333 4.3320 5.7519 4.9113 2.8939 6.8022 10.5689 10.9584 7.5400 6.0368 8.2642 3.2084 5.9440 4.7306 5.3776 3.7583 4.2922 4.8968 8.9866 3.4824 2.2266 5.1726 4.9003 3.5581 3.2915 1.3176 4.7391 1.2561 4.3958 5.9613 6.5011 6.1532 5.9155 4.8035 1.6650 5.0094 5.5737 5.8943 3.5309 4.3098 3.9987 4.9719 1.5527 5.4658 1.5091 2.6449 3.8236 2.5299 5.5796 1.3384 2.4176 3.0593 2.8466 3.0465 2.1563 2.5887 2.9078 5.4340 1.4009 1.4088 5.5896 1.4420 1.4007 5.5993 1.3669 1.3895 2.8720 2.0394 2.2653 1.8503 3.1744 2.7910 1.4691 2.0158 2.8243 1.0884 1.1350 1.2497 1.6077 1.2536 2.0451 2.2729 2.6812 1.8936 2.0900 2.0074 2.8762 1.9909 2.0804 1.8511 2.1253 2.5982 1.4663 2.8816 2.3658 2.9350 9.2755 6.4774 2.6698 2.5926 2.3264 2.4642 1.1153 2.6012 2.8467 2.5577 12.3679 12.8287 7.5879 7.1520 7.9226 3.1364 1.9340 6.9310 7.7354 8.0568 8.1168 6.2640 7.3828 4.2181 1.0802 1.0620 1.0992 1.0887 1.0878 1.0883 1.0865 1.0964 1.0878 1.0912 1.0949 1.0932 1.0974 1.1004 1.0963 1.0657 1.0447 1.0656 1.1044
irintensity: 0.9692 1.0712 2.8203 6.3679 1.1556 3.0781 2.8159 0.2100 0.4310 0.4322 2.9442 1.7974 1.2666 3.1273 0.7838 4.5687 0.1055 3.1257 0.5168 2.6641 1.0001 33.2885 3.3268 29.4614 24.4738 7.1102 11.2745 0.9199 6.2009 9.1417 1.3392 5.9011 1.7327 0.1105 1.9766 5.2362 0.2141 1.6055 23.4023 22.0218 6.1260 0.2142 4.5350 1.0736 0.6617 14.5676 7.9967 32.8182 171.5829 6.2771 94.2054 12.4217 3.7391 4.8951 2.3666 7.6658 9.0940 61.1557 38.3274 2.4880 15.5495 10.2171 24.4393 10.1701 11.6059 74.2000 7.0273 52.6024 13.4556 1.5117 3.6223 22.4116 2.3289 4.2106 4.1571 11.1158 8.4017 2.6046 9.8962 10.9103 7.7643 2.6665 2.4395 19.3511 1.8867 4.2885 15.3124 0.0674 0.5639 7.7774 0.6331 9.0356 1.1879 25.0197 11.3487 5.2834 31.7123 17.2110 4.6772 0.6462 22.9850 20.1646 13.4685 49.9781 23.5738 22.4755 0.1708 53.6792 36.9561 49.0338 41.9394 30.3883 51.1206 8.6415 110.3781 7.0094 94.0214 26.2709 13.9961 3.0698 26.7043 61.4715 2.5577 11.6718 13.9372 7.6146 21.9904 38.6548 67.2587 220.1208 277.1827 5.4182 7.5473 6.4585 17.5119 226.0585 34.9299 28.0767 15.2495 10.2788 9.9207 19.7118 377.0805 25.4312 14.3308 3.3065 20.5750 8.6919 12.0660 3.6496 13.1945 3.7997 5.7179 5.3656 2.6429 19.5447 20.4165 8.1233 527.8177 29.5858 33.9650 61.7412
temp: 298.150 k
press: 1.00000 atm
elementType: 8 8 8 8 8 8 8 7 6 6 6 6 6 6 6 6 6 6 6 6 6 6 6 6 6 6 6 6 6 6 6 6 6 6 6 6 6 1 1 1 1 1 1 1 1 1 1 1 1 1 1 1 1 1 1 1
symmnumber: 1
zpe: 1072630.0 jmol-1
zpe.correction: 0.408543 hartree
zpe.thermalcorrener: 0.439991 hartree
zpe.thermalcorrenthalpy: 0.440935 hartree
zpe.thermalcorrgfe: 0.341208 hartree
zpe.sumelectzpe: -1695.266772 hartree
zpe.sumelectthermal: -1695.235324 hartree
zpe.sumelectthermalent: -1695.234380 hartree
zpe.sumelectthermalfe: -1695.334108 hartree
dipole: 0.3500 2.5832 10.6853
dipole: 10.9987
quadrupole: -226.5094 -217.3504 -215.0357
quadrupole: -37.2397 41.7400 7.1112
quadrupole: -6.8776 2.2814 4.5961 -37.2397 41.7400 7.1112
hfenergy: -1695.6753154 hartree
pointgroup: C01 [X(C29H19N1O7)]
dipole: -0.0360902 -0.8924075 4.2340598 debye
polarizability: 419.8176486|-11.8239362|357.2622788|22.3835743|-16.6675043|322.6368373 unknown
InChI: InChI=1S/C29H19NO7/c30-20(31)13-14-9-11-15(12-10-14)21(22-24(32)16-5-1-3-7-18(16)26(34)28(22)36)23-25(33)17-6-2-4-8-19(17)27(35)29(23)37/h1-12,21,32-33H,13,30H2
charge 0 multiplicity 1
56 atoms
O  -1.002182 0.052482 1.630468
O  1.8596 -0.494497 1.131015
O  -2.061033 1.44136 -2.795346
O  -1.212497 -2.022488 -2.276938
O  -4.754871 1.787198 -2.093181
O  -0.398459 -4.65162 -1.768359
O  6.05981 4.900059 0.967496
N  5.252613 2.724511 1.025223
C  -0.114266 0.265411 -1.092715
C  -1.52149 0.610998 -0.60703
C  0.336672 -1.143124 -0.672205
C  0.934185 1.368852 -0.865728
C  -1.960114 0.450342 0.693453
C  1.261494 -1.443569 0.323768
C  -2.443401 1.1559 -1.623053
C  -0.308335 -2.23825 -1.409832
C  -3.34862 0.699191 1.140856
C  1.701853 -2.817472 0.642848
C  2.100621 1.370354 -1.678107
C  0.786139 2.407135 0.0899
C  -4.317687 1.138745 0.188675
C  1.148932 -3.925648 -0.063481
C  -3.926118 1.391193 -1.230897
C  0.120819 -3.702846 -1.119228
C  2.958574 3.384909 -0.547361
C  3.092521 2.357531 -1.52166
C  1.78516 3.39587 0.246699
C  -3.756932 0.512055 2.486374
C  2.670493 -3.051724 1.649895
C  -5.656802 1.360164 0.583543
C  1.568348 -5.242454 0.240858
C  4.046342 4.422985 -0.350493
C  -5.097637 0.731352 2.872732
C  3.084861 -4.369183 1.945193
C  -6.053973 1.153498 1.920813
C  2.535907 -5.468429 1.24184
C  5.203748 4.041255 0.608361
H  -0.244889 0.200495 -2.193651
H  2.219165 0.5945 -2.443726
H  -0.120184 2.458084 0.701866
H  3.976079 2.343776 -2.171473
H  1.646275 4.189515 0.990535
H  -3.051914 0.197497 3.267422
H  3.088984 -2.199508 2.190627
H  -6.36623 1.697194 -0.179291
H  1.120332 -6.068821 -0.320497
H  4.528422 4.679029 -1.312696
H  3.63273 5.366722 0.046465
H  -1.395192 -0.213528 2.497978
H  1.513061 0.418962 0.921507
H  -5.39276 0.576057 3.915487
H  3.836183 -4.539339 2.72382
H  -7.092414 1.322397 2.222017
H  2.860505 -6.487916 1.474125
H  4.554777 2.040414 0.734957
H  6.014392 2.441122 1.640934
